{"text_format":"1","workbook":"xlsx","n_sheets":14,"sheets":["1. Yfirlit","2. Orkurammi","3. Þykkt einangrunar","4. Hiti á efnisskilum","5. Gluggar&Hurðir","6. Orkubúskapur","7. Raki_rakamagn","8. Raki_mettunarþrýst","9. Alg. leiðnitölur","10. Veðurgögn","11. Raki_töflur","12. Gerðir","13. Leiðbeiningar","Tölur fyrir gröf"],"not_rendered":{"charts":13,"images":1,"macros":1,"external_links":1,"defined_names":71,"comments":8,"pivot_tables":0},"unopened":[],"bounds":{"document_bytes":16777216,"sheet_cells":100000,"rows_first":2000,"rows_last":500,"rows_between":2000,"halvings":0,"cell_chars":16384,"cell_head_chars":4096},"cells_cut":0,"cells_raw":0,"read":"whole","date_system":"1900"}

{"sheet":"1. Yfirlit","index":0,"n_rows":46,"n_cols":7,"rows_kept":46,"cut":false,"hidden":false,"merged":[[0,0,1,7]]}
[" Orkurammi - Yfirlit"]
[]
[]
[null,"Þak","Ureglugerð","Notað"]
[null,{"$f":"HYPERLINK(\"[\"&B46&\"]Létt_þak\",\"Létt þak\")","v":"Létt þak"},0.2]
[null,{"$f":"HYPERLINK(\"[\"&B46&\"]Uppstólað_þak_á_steypta_plötu\",\"Uppstólað þak á steypta plötu\")","v":"Uppstólað þak á steypta plötu"},0.2]
[null,{"$f":"HYPERLINK(\"[\"&B46&\"]Viðsnúið_þak\",\"Viðsnúið þak\")","v":"Viðsnúið þak"},0.2]
[null,{"$f":"HYPERLINK(\"[\"&B46&\"]Kalt_þak\",\"Kalt þak\")","v":"Kalt þak"},0.2]
[null,{"$f":"HYPERLINK(\"[\"&B46&\"]Þak_annað\",\"Annað\")","v":"Annað"},0.2]
[null,"Steyptir veggir"]
[null,{"$f":"HYPERLINK(\"[\"&B46&\"]Steyptur_veggur_einangraður_að_innan\",\"Steyptur veggur einangraður að innan\")","v":"Steyptur veggur einangraður að innan"},0.4]
[null,{"$f":"HYPERLINK(\"[\"&B46&\"]Steyptur_veggur_einangraður_að_utan\",\"Steyptur veggur einangraður að utan\")","v":"Steyptur veggur einangraður að utan"},0.4]
[null,{"$f":"HYPERLINK(\"[\"&B46&\"]Steyptur_veggur_annað\",\"Annað\")","v":"Annað"},0.4]
[null,"Léttir veggir"]
[null,{"$f":"HYPERLINK(\"[\"&B46&\"]Léttur_veggur\",\"Léttur veggur\")","v":"Léttur veggur"},0.3]
{"$rows_left_out":32}
{"sheet":"2. Orkurammi","index":1,"n_rows":48,"n_cols":15,"rows_kept":48,"cut":false,"hidden":false,"merged":[[46,0,46,3],[12,0,13,0],[12,1,13,1],[10,8,10,9],[1,0,2,0],[1,1,2,1],[44,0,44,3],[8,7,8,9],[44,4,44,5],[19,12,19,14],[8,12,8,14],[5,13,5,14],[6,13,6,14],[2,7,2,14],[3,7,3,14],[4,13,4,14],[7,13,7,14]]}
["TAFLA 1  ORKURAMMI",null,null,null,null,null,null,"ATH! Gera þarf haus (header) á orkurammann. Hausinn sést ekki í normal view, til þess að sjá og uppfæra hausinn, "]
["Byggingarhluti","Lýsing","Flatarmál","U","U· A",null,null,"skal velja View og svo Page layout. Fylla svo inn á viðeigandi staði"]
[null,null,"A (m2)",null,null,null,null,"Athuga skal að nota skal töflurnar hér að neðan við gerð orkurammans, þar sem viðeigandi reitir í Orkurammanum uppfærast útfrá "]
[null,null,null,null,null,null,null,"töflunum. Aðeins skal slá inn í þá reiti orkurammans sem eru með bláum lit (s.s lengd kuldabrúa)"]
["Þak","Létt timburþak",{"$f":"N11","v":200},0.2,{"$f":"+C5*D5","v":40},null,null,null,null,null,null,null,null,"\"Loka\" U-gildi"]
["Steyptir veggir","180mm, steinað",{"$f":"N12","v":150},0.4,60,null,null,"ATH! Skjalið er stillt (print area) þannig að töflurnar hér að neðan",null,null,null,"ATH! Áður en orkuramminn er prentaður er góð",null,"Veljið af lista"]
["Léttir veggir","Ekki ",{"$f":"N13","v":0},0.3,0,null,null,"prentast ekki, heldur aðeins orkuramminn. Hægt er að breyta",null,null,null,"hugmynd að fjarlægja bláa litinn úr reitum (s.s",null,"Innsláttarreitir"]
["Gólf","120 mm plata á fyll.",{"$f":"N14","v":200},0.3,60,null,null,"því með því að velja page layout (clear print area/add to print area)",null,null,null,"reitum fyrir lýsingar og kuldabrýr), þ.e. nota \"No fill\"",null,"Einangrunarþykktir"]
["Gluggar/Hurðir",null,{"$f":"N15+N16","v":22},2,44,null,null,"Gerð einstakra byggingarhluta",null,null,null,null,"Flatarmál byggingarhluta"]
[null,null,null,null,null,null,null,"Gólf",null,null,null,null,"Byggingarhluti","Flatarmál (m2)"]
[null,null,"Orkurammi","Σ U· A",{"$f":"SUM(E5:E10)","v":204},null,null,"Veljið gólfgerð",null,null,null,null,"Þak",200]
["TAFLA 2 RAUNTAP GEGNUM HJÚP OG BOTNPLÖTU",null,null,null,null,null,null,"Gólf án gólfgeisla",{"$f":"INDEX(Gólfstuðlar,Valin_röð_gólf)","v":0.42857142857142855},"?",null,null,"Steyptir veggir",150]
["Byggingarhluti","Lýsing","Flatarmál","U","U· A","Einangrunarþ.",null,"Ef gólfgeisli, er einangrað undir geisla?","Nei",null,null,null,"Léttir veggir",0]
[null,null,"A (m2)",null,null,"mm",null,"Leiðrétt. vegna kuldabrúr undir innvegg",{"$f":"IF(I13=\"Nei\",45/35,1)","v":1.2857142857142858},null,null,null,"Gólf (Botnplata)",200]
[null,null,null,null,null,null,null,null,null,null,null,null,"Gluggar ",18]
{"$rows_left_out":34}
{"sheet":"3. Þykkt einangrunar","index":2,"n_rows":686,"n_cols":9,"rows_kept":686,"cut":false,"hidden":false,"merged":[[660,3,660,8],[412,3,412,8],[467,3,467,8],[298,5,300,8],[352,5,354,8],[514,3,514,8],[554,3,554,8],[602,3,602,8],[409,5,411,8],[464,5,466,8],[2,5,4,8],[91,5,93,8],[136,5,138,8],[191,5,193,8],[244,5,246,8],[247,3,247,8],[5,3,5,8],[355,3,355,8],[44,3,44,8],[94,3,94,8],[139,3,139,8],[194,3,194,8],[301,3,301,8],[41,5,43,8]]}
[]
[]
[null,null,null,"Er einangrunarþykkt vituð? (Já/Nei)","Nei","Taflan reiknar út einangrunarþykkt og U gildi, eða U gildi ef einangrunarþykkt er vituð"]
[null,null,null,"Ef Já, hver er einangrunarþykktin (m) ?","?"]
[]
[null,null,null,"Steyptur veggur einangraður að innan"]
[null,null,null,null,null,null,"d","λ","R"]
[null,null,null,null,null,null,"m","W/mK"]
[null,null,null,"Ytra yfirborð",null,null,null,null,0.04]
[null,null,null,"Marmarasalli",null,null,1E-3,3,{"$f":"+G10/H10","v":3.3333333333333332E-4}]
[null,null,null,"Múrhúð",null,null,0.02,1.4,{"$f":"+G11/H11","v":1.4285714285714287E-2}]
[null,null,null,"Járnbent steinsteypa",null,null,0.18,1.95,{"$f":"+G12/H12","v":9.2307692307692313E-2}]
[null,null,null,"Frauðplast",null,null,{"$f":"(I19-SUM(I9:I12)-SUM(I14:I15))*H13","v":8.588735714285714E-2},3.9E-2,{"$f":"IF(E3=\"Já\",E4/H13,G13/H13)","v":2.2022399267399266}]
[null,null,null,"Múrhúð",null,null,2.5000000000000001E-2,1.2,{"$f":"+G14/H14","v":2.0833333333333336E-2}]
[null,null,null,"Innra yfirborð",null,null,null,null,0.13]
{"$rows_left_out":672}
{"sheet":"4. Hiti á efnisskilum","index":3,"n_rows":75,"n_cols":32,"rows_kept":75,"cut":false,"hidden":true,"merged":[[56,1,56,6],[56,26,56,31],[1,1,1,6],[1,26,1,31]]}
[]
[null,"Steyptur veggur einangraður að innan - Hitastig á efnisskilum",null,null,null,null,null,null,null,null,null,null,null,null,null,null,null,null,null,null,null,null,null,null,null,null,"Steyptur veggur einangraður að utan - Hitastig á efnisskilum"]
[null,null,"d","λ","R","ΔT","T",null,null,null,null,null,null,null,null,null,null,null,null,null,null,null,null,null,null,null,null,"d","λ","R","ΔT","T"]
[null,null,"m","W/mK",null,"°C","°C",null,null,null,null,null,null,null,null,null,null,null,null,null,null,null,null,null,null,null,null,"m","W/mK",null,"°C","°C"]
[null,"Hitastig úti",null,null,null,null,-15,null,null,null,null,null,null,null,null,null,null,null,null,null,null,null,null,null,null,null,"Hitastig úti",null,null,null,null,-15]
[]
[null,"Ytra yfirborð",null,null,{"$f":"'3. Þykkt einangrunar'!I9","v":0.04},{"$f":"E7/$E$22*(G$5-$G$21)","v":-0.56000000000000005},null,null,null,null,null,null,null,null,null,null,null,null,null,null,null,null,null,null,null,null,"Ytra yfirborð",null,null,{"$f":"'3. Þykkt einangrunar'!I48","v":0.13},{"$f":"AD7/$AD$20*($AF$5-$AF$19)","v":-1.1830000000000001}]
[null,null,null,null,null,null,{"$f":"G5-F7","v":-14.44},null,null,null,null,null,null,null,null,null,null,null,null,null,null,null,null,null,null,null,null,null,null,null,null,{"$f":"AF5-AE7","v":-13.817}]
[null,"Marmarasalli",{"$f":"'3. Þykkt einangrunar'!G10","v":1E-3},{"$f":"'3. Þykkt einangrunar'!H10","v":3},{"$f":"+C9/D9","v":3.3333333333333332E-4},{"$f":"E9/$E$22*(G$5-$G$21)","v":-4.6666666666666671E-3},null,null,null,null,null,null,null,null,null,null,null,null,null,null,null,null,null,null,null,null,"Klæðning",{"$f":"'3. Þykkt einangrunar'!G49","v":0.02},{"$f":"'3. Þykkt einangrunar'!H49","v":0.16},null,{"$f":"AD9/$AD$20*($AF$5-$AF$19)","v":0}]
[null,null,null,null,null,null,{"$f":"G8-F9","v":-14.435333333333332},null,null,null,null,null,null,null,null,null,null,null,null,null,null,null,null,null,null,null,null,null,null,null,null,{"$f":"AF8-AE9","v":-13.817}]
[null,"Múrhúð",{"$f":"'3. Þykkt einangrunar'!G11","v":0.02},{"$f":"'3. Þykkt einangrunar'!H11","v":1.4},{"$f":"+C11/D11","v":1.4285714285714287E-2},{"$f":"E11/$E$22*(G$5-$G$21)","v":-0.20000000000000004},null,null,null,null,null,null,null,null,null,null,null,null,null,null,null,null,null,null,null,null,"Loftræst bil (mikið)",{"$f":"'3. Þykkt einangrunar'!G50","v":0.02},null,null,0]
[null,null,null,null,null,null,{"$f":"G10-F11","v":-14.235333333333333},null,null,null,null,null,null,null,null,null,null,null,null,null,null,null,null,null,null,null,null,null,null,null,null,{"$f":"AF10-AE11","v":-13.817}]
[null,"Járnbent steinsteypa",{"$f":"'3. Þykkt einangrunar'!G12","v":0.18},{"$f":"'3. Þykkt einangrunar'!H12","v":1.95},{"$f":"+C13/D13","v":9.2307692307692313E-2},{"$f":"E13/$E$22*(G$5-$G$21)","v":-1.2923076923076924},null,null,null,null,null,null,null,null,null,null,null,null,null,null,null,null,null,null,null,null,"Steinull, veggplata",{"$f":"IF('3. Þykkt einangrunar'!E42=\"Nei\",'3. Þykkt einangrunar'!G51,'3. Þykkt einangrunar'!E43)","v":0.12228461538461539},{"$f":"'3. Þykkt einangrunar'!H51","v":3.5000000000000003E-2},{"$f":"AB13/AC13","v":3.4938461538461536},-31.794]
[null,null,null,null,null,null,{"$f":"G12-F13","v":-12.94302564102564},null,null,null,null,null,null,null,null,null,null,null,null,null,null,null,null,null,null,null,null,null,null,null,null,{"$f":"AF12-AE13","v":17.977}]
[null,"Frauðplast",{"$f":"IF('3. Þykkt einangrunar'!E3=\"Nei\",'3. Þykkt einangrunar'!G13,'3. Þykkt einangrunar'!E4)","v":8.588735714285714E-2},{"$f":"'3. Þykkt einangrunar'!H13","v":3.9E-2},{"$f":"+C15/D15","v":2.2022399267399266},{"$f":"E15/$E$22*(G$5-$G$21)","v":-30.831358974358974},null,null,null,null,null,null,null,null,null,null,null,null,null,null,null,null,null,null,null,null,"Járnbent steinsteypa",{"$f":"'3. Þykkt einangrunar'!G54","v":0.18},{"$f":"'3. Þykkt einangrunar'!H54","v":1.95},{"$f":"AB15/AC15","v":9.2307692307692313E-2},-0.84000000000000019]
{"$rows_left_out":61}
{"sheet":"5. Gluggar&Hurðir","index":4,"n_rows":51,"n_cols":41,"rows_kept":51,"cut":false,"hidden":false,"merged":[[0,0,2,9],[13,32,13,36],[13,37,13,40],[13,2,13,4],[13,5,13,6],[13,7,13,9],[13,10,13,18],[13,19,13,26],[13,27,13,31]]}
["Gluggar og hurðir"]
[]
[]
[null,"Tafla 1"]
[null,"Inntaksstærðir","mm"]
[null,"Falsdýpt ",22]
[null,"Karmbreidd",62]
[null,"Póstabreidd",75]
[null,"Opnanlegt fag ",75]
[null,"Hurðarstykki hlið, ofan og milli ",120]
[null,"Hurðarstykki neðan ",200]
[]
[null,"Tafla 2"]
[null,"Gluggi / Hurð","Múrmál",null,null,"Karmlengd",null,"Póstalengd",null,null,"Fast gler (ljósmál)",null,null,null,null,null,null,null,null,"Opnanlegt fag / hurð",null,null,null,null,null,null,null,"Gler",null,null,null,null,"Spjöld",null,null,null,null,"Samtals"]
[null,null,"b [mm]","h [mm]","A [m2]","Lk [mm]","ψ (W/mK)","Lp [mm]","ψ (W/mK)","(A*U)k  [W/K]","b1 [mm]","h1 [mm]","b2 [mm]","h2 [mm]","b3 [mm]","h3 [mm]","Ag [m2]","Ug [W/m2K)","(A*U)g [W/K]","Fjöldi","bf [mm]","hf [mm]","Ummál [mm]","Afag [m2]","Ufag [W/m2K]","ψfag [W/mK]","(A*U)fag","bog [mm]","hog [mm]","Aog [m2]","Uog [W/m2K]","(A*U)og [W/K]","bs [mm]","hs [mm]","As [m2]","Us [W/m2K]","(A*U)s [W/K]","Agler [m2]","A*U [W/K]","Uvegið [W/m2K]","Glerhlutfall"]
{"$rows_left_out":37}
{"sheet":"6. Orkubúskapur","index":5,"n_rows":42,"n_cols":13,"rows_kept":42,"cut":false,"hidden":false,"merged":[[1,8,1,12],[0,0,0,5],[11,7,11,12]]}
["Mat á afl- og varmaþörf byggingar",null,null,null,null,null,null,"Veljið stað á landinu",null,null,null,null,"Tafla 4 Varmaþörf á mánaðargrundvelli"]
[null,null,null,null,null,null,null,"Reykjavík","Áætluð varmaþörf (gögn frá 2012)"]
["Tafla 1  Heildarvarmaleiðnitap",null,null,null,null,null,null,"Ársmeðalhiti",{"$f":"'10. Veðurgögn'!B32","v":5.6},"°C"]
["Byggingarhluti","U [W/m2K]","A         [m2]","U*A     [W/K]","Δt              [K]","Ф          [W]",null,"Mánuður","Gráðutímar","Varmaþörf [kWh/mán]","Mánuður","Gráðutímar","Varmaþörf [kWh/mán]"]
["Þak",{"$f":"'2. Orkurammi'!D16","v":0.20000000000000007},{"$f":"'2. Orkurammi'!C16","v":200},{"$f":"B5*C5","v":40.000000000000014},35,{"$f":"D5*E5","v":1400.0000000000005},null,"Janúar",{"$f":"'10. Veðurgögn'!B18","v":14554.600000000006},{"$f":"I5*($B$24+$B$34)*0.001","v":4837.4030408980998},"Júlí",{"$f":"'10. Veðurgögn'!H18","v":5644.0000000000055},{"$f":"L5*($B$24+$B$34)*0.001","v":1875.8538718225777}]
["Steyptir veggir",{"$f":"'2. Orkurammi'!D17","v":0.4},{"$f":"'2. Orkurammi'!C17","v":150},{"$f":"B6*C6","v":60},35,{"$f":"D6*E6","v":2100},null,"Febrúar",{"$f":"'10. Veðurgögn'!C18","v":12138.799999999992},4034.4817468603596,"Ágúst",{"$f":"'10. Veðurgögn'!I18","v":5691.4000000000015},1891.6078536660189]
["Léttir veggir",{"$f":"'2. Orkurammi'!D18","v":0.3},{"$f":"'2. Orkurammi'!C18","v":0},0,35,0,null,"Mars",{"$f":"'10. Veðurgögn'!D18","v":12618.200000000006},4193.816322719993,"September",{"$f":"'10. Veðurgögn'!J18","v":9099.1999999999935},3024.2327339631411]
["Gólf",{"$f":"'2. Orkurammi'!D19","v":0.3},{"$f":"'2. Orkurammi'!C19","v":200},{"$f":"'2. Orkurammi'!E19","v":25.714285714285712},35,899.99999999999989,null,"Apríl",{"$f":"'10. Veðurgögn'!E18","v":11278},3748.3841187836661,"Október",{"$f":"'10. Veðurgögn'!K18","v":11550.800000000005},3839.0526050049998]
["Gluggar",{"$f":"'2. Orkurammi'!D20","v":1.7040936948624805},{"$f":"'2. Orkurammi'!C20","v":18},30.67368650752465,35,1073.5790277633628,null,"Maí",{"$f":"'10. Veðurgögn'!F18","v":10167.100000000006},3379.1626329212122,"Nóvember",{"$f":"'10. Veðurgögn'!L18","v":13304.500000000007},4421.9166969637618]
["Hurðir",{"$f":"'2. Orkurammi'!D21","v":1.6632713388348319},{"$f":"'2. Orkurammi'!C21","v":4},6.6530853553393277,35,232.85798743687647,null,"Júní",{"$f":"'10. Veðurgögn'!G18","v":6702.5999999999995},2227.6927996594609,"Desember",{"$f":"'10. Veðurgögn'!M18","v":13861.799999999997},4607.1423104943615]
["Heild byggingarhluta",null,null,{"$f":"SUM(D5:D10)","v":163.0410575771497},null,{"$f":"SUM(F5:F10)","v":5706.4370152002384},null,"Heild",{"$f":"SUM(I5:I10)+SUM(L5:L10)","v":126611.00000000003},"°Ch/ár",null,{"$f":"SUM(J5:J10)+SUM(M5:M10)","v":42080.746733757653},"kWh/ár"]
["Kuldabrýr","ψ     [W/mK]","l            [m]","ψ·L (W/K)","Δt              [K]","Ф          [W]"]
["Lóðréttar kuldabrýr við úthorn",{"$f":"'2. Orkurammi'!D27","v":0.04},{"$f":"'2. Orkurammi'!C27","v":12},{"$f":"B13*C13","v":0.48},35,{"$f":"D13*E13","v":16.8}]
["Láréttar kuldabrýr við plötuskil",{"$f":"'2. Orkurammi'!D28","v":0.83},{"$f":"'2. Orkurammi'!C28","v":0},{"$f":"B14*C14","v":0},35,{"$f":"D14*E14","v":0}]
["Lóðréttar kuldabrýr við útvegg/innvegg",{"$f":"'2. Orkurammi'!D29","v":0.83},{"$f":"'2. Orkurammi'!C29","v":9},7.47,35,261.45]
{"$rows_left_out":28}
{"sheet":"7. Raki_rakamagn","index":6,"n_rows":174,"n_cols":14,"rows_kept":174,"cut":false,"hidden":true,"merged":[[13,1,13,6],[48,1,48,6],[109,1,109,6],[144,1,144,6]]}
[]
[]
[null,"Reikningar miðast við eftirfarandi umhverfisaðstæður"]
[null,null,"Lofthiti (°C)","Loftraki (%HR)"]
[null,"Vetur"]
[null,"Inni",22,40]
[null,"Úti",-2,80]
[null,"Sumar"]
[null,"Inni",22,55]
[null,"Úti",10,80]
[]
[]
[null,"VETUR"]
[null,"Steyptur veggur einangraður að innan - Hitastig á efnisskilum"]
[null,null,"d","λ","R","ΔT","T",null,null,"Z",null,null,"HR"]
{"$rows_left_out":160}
{"sheet":"8. Raki_mettunarþrýst","index":7,"n_rows":79,"n_cols":15,"rows_kept":79,"cut":false,"hidden":true,"merged":[[12,1,12,6],[49,1,49,6]]}
[]
[null,"Reikningar miðast við eftirfarandi umhverfisaðstæður"]
[]
[null,null,"Lofthiti (°C)","Loftraki (%HR)"]
[null,"Vetur"]
[null,"Inni",22,40]
[null,"Úti",-2,80]
[null,"Sumar"]
[null,"Inni",22,55]
[null,"Úti",10,80]
[]
[null,"VETUR"]
[null,"Steyptur veggur einangraður að innan - Hitastig á efnisskilum"]
[null,null,"d","λ","R","ΔT","T",null,null,null,"Z","Rakaþrýst","Mettunarþr.","HR"]
[null,null,"m","W/mK",null,"°C","°C","-",null,null,"s/m","Pa","Pa","%"]
{"$rows_left_out":65}
{"sheet":"9. Alg. leiðnitölur","index":8,"n_rows":66,"n_cols":9,"rows_kept":66,"cut":false,"hidden":false,"merged":[[0,0,0,4]]}
["Algengar varmaleiðnitölur  (auk  U gilda fyrir gluggagler)"]
[]
["Efni","Eðlisþéttleiki bil [kg/m3]","Algengasti eðlisþéttleiki [kg/m3]","Leiðnitala bil [W/mK]","Leiðnitala [W/mK]"]
["Steinsteypa, múrhúð"]
["Steypa, bent og óbent","2200-2300",2300,"1,7-1,95",1.95]
["Múrhúð rök (sement/sandur)","1800-1900",1900,1.4,1.4]
["Múrhúð þurr (sement/sandur)","1800-1900",1900,1.2,1.2]
["Múrhúð, kalk sement og sandur",1800,1800,1,1]
["Léttsteypa"]
["Frauðsteypa","300-700",null,"0,13-0,25",0.2]
["Vikursteypa","500-1000",null,"0,20-0,30",0.26]
["Gjallsteypa","1000-1400",null,"0,33-0,55",0.5]
["Grjót, sandur og möl"]
["Basalt, blágrýti, grágrýti","2700-3000",null,"2,3-3,5"]
["Jarðvegur (rakur)","1500-2000",1900,"1,4-2,5",2.2999999999999998]
{"$rows_left_out":52}
{"sheet":"10. Veðurgögn","index":9,"n_rows":50,"n_cols":14,"rows_kept":50,"cut":false,"hidden":true,"merged":[[0,0,1,13],[34,2,34,3],[49,2,49,3]]}
["Veðurgögn - Gráðutímafjöldi"]
[]
[]
["Tafla 1     Veðurgögn frá sjálfvirkum veðurstöðvum fyrir árið 2012 (heimild Veðurstofa Íslands)"]
[null,"Janúar ","Febrúar","Mars","Apríl","Maí","Júní","Júlí","Ágúst","September","Október","Nóvember","Desember","Samtals"]
["Akureyri",14522.399999999998,12193.599999999991,12476.599999999991,13003.999999999993,10673.999999999996,8285.0000000000036,6435.5000000000009,5974.8000000000011,10050.399999999996,13180.999999999995,14942.100000000008,15608.199999999995,137347.59999999995]
["Egilsstaðir",14811.500000000002,12209.699999999997,12714.500000000011,13817.399999999989,11469.200000000008,9101.9,7229.7999999999947,6930.2999999999993,9941.2000000000025,13496.100000000008,14893.399999999981,16450.80000000001,143065.79999999999]
["Hella",15807.699999999999,12379.600000000011,12938.200000000015,11677,10404,6890.6999999999971,5518.9999999999991,6011.4000000000087,9728.9000000000015,12667.900000000011,14419.4,14799.299999999988,133243.10000000003]
["Ísafjörður",14862.099999999999,12995.200000000015,13486.299999999994,12923.399999999992,11086.499999999987,8398.8000000000102,6524.6999999999989,6710.5000000000036,10020.599999999999,12975.999999999987,14279.200000000006,14835.899999999991,139099.19999999995]
["Keflavík",14424.500000000015,12083.20000000001,12695.199999999977,11398.600000000008,10463.89999999998,6855.7999999999975,5795.800000000002,6077.6999999999935,9152.8000000000084,11474.500000000005,13282.599999999999,13647.399999999972,127351.99999999994]
["Reykjavík",14554.600000000006,12138.799999999992,12618.200000000006,11278,10167.100000000006,6702.5999999999995,5644.0000000000055,5691.4000000000015,9099.1999999999935,11550.800000000005,13304.500000000007,13861.799999999997,126611.00000000001]
[]
["Tafla 2"]
["Sjálfvirk uppfærsla gagna"]
["Valin röð",{"$f":"MATCH('6. Orkubúskapur'!H2,Staður,0)","v":6}]
{"$rows_left_out":36}
{"sheet":"11. Raki_töflur","index":10,"n_rows":68,"n_cols":4,"rows_kept":68,"cut":false,"hidden":true,"merged":[[0,0,0,9]]}
["Útreikningur á rakaflutningi"]
[]
["1. Mettunarrakamagn         í lofti [g/m3] - Heimild Sandin 2010"]
[]
["Nálgunarformúlur byggðar á töflu (TABELL 4.4) hér til hliðar:"]
[]
[]
[]
[]
[]
[]
[]
[]
[]
[]
{"$rows_left_out":54}
{"sheet":"12. Gerðir","index":11,"n_rows":78,"n_cols":3,"rows_kept":78,"cut":false,"hidden":true,"merged":[]}
[]
["Gólfgerðir","Leiðrétting vegna hitamunar","Hitamunur"]
["Gólf án gólfgeisla",{"$f":"15/35","v":0.42857142857142855},15]
["Gólf m/gólfgeisla og einangrað á milli",{"$f":"20/35","v":0.5714285714285714},20]
["Gólf m/gólfgeisla ísteyptum í gólfplötu",{"$f":"'4. Hiti á efnisskilum'!G67/35","v":0.71978021978021978},{"$f":"'4. Hiti á efnisskilum'!G67","v":25.192307692307693}]
["Önnur","Sláið inn gildi",{"$f":"'2. Orkurammi'!J12*35","v":{"$error":"#VALUE!"}}]
[]
[{"$f":"MATCH('2. Orkurammi'!H12,Gólfgerðir,0)","v":1}]
[]
[]
["Gler","U gildi      [W/m2K]"]
["Tvöfalt venjulegt (12 mm loftbil)",2.9]
["Sólvarnargler - Energy N",1.1000000000000001]
["TopN+ (16 mm gasfyllt bil)",1.1000000000000001]
["TopN+ (12 mm gasfyllt bil)",1.3]
{"$rows_left_out":64}
{"sheet":"13. Leiðbeiningar","index":12,"n_rows":423,"n_cols":13,"rows_kept":423,"cut":false,"hidden":false,"merged":[[39,0,39,8],[39,10,39,18],[40,0,40,8],[41,0,41,8],[38,0,38,8],[0,0,1,8],[34,0,34,8],[35,0,35,8],[37,0,37,8],[30,0,30,8],[31,0,31,8],[32,0,32,8],[33,0,33,8],[36,0,36,8]]}
["Leiðbeiningar",null,null,null,null,null,null,null,null,null,null,null,{"$f":"'1. Yfirlit'!B46","v":"Orkurammi_mini.xlsm"}]
[]
[]
["Verkefnaskjal (workbook) þetta var unnið sumarið 2013 í samstarfi við Mannvirkjastofnun.."]
["Lögum samkvæmt er hlutverk Mannvirkjastofunar m.a. að annast gerð leiðbeininga og hafa"]
["eftirlit með því að þeim lögum sé framfylgt sem lúta að fagsviði stofnunarinnar."]
[]
["Skjal þetta er hugsað sem aðstoð fyrir hönnuði við gerð orkureikninga og orkuramma, á "]
["hönnunarstigi byggingar. Lagt hefur verið upp með það að gera skjalið eins gagnvirkt og kostur er. "]
["Þannig geta hönnuðir prófað sín hönnun, þ.e. hvort ákvæðum í byggingarreglugerð varðandi "]
["leiðnitap byggingarhluta o.þ.h sé fullnægt. Ef hönnun uppfyllir ekki reglugerð eða ef viðkomandi vill "]
["prófa aðra hönnunarmöguleika er það auðvelt með hjálp forritsins. Þannig er hægt að prófa mismunandi"]
["gerðir byggingarhluta, mismunandi gler í glugga, skoða áhrif kuldabrúa og o.s.frv. Skjal þetta getur einnig"]
["komið sé vel sem lærdómstól fyrir þá sem eru að stíga sín fyrstu skref í þessum fræðum. Ath. skjal að"]
["er ekki ætlað til nákvæmnishönnunar á byggingum heldur tæki þar sem hönnuðir geta grófhannað hús"]
{"$rows_left_out":409}
{"sheet":"Tölur fyrir gröf","index":13,"n_rows":23,"n_cols":11,"rows_kept":23,"cut":false,"hidden":true,"merged":[]}
[]
[null,0,30,null,null,null,null,null,null,0,{"$f":"'4. Hiti á efnisskilum'!AF63","v":30}]
[null,{"$f":"'4. Hiti á efnisskilum'!C64","v":0.03},{"$f":"'4. Hiti á efnisskilum'!G65","v":30},null,null,null,null,null,null,{"$f":"'4. Hiti á efnisskilum'!AB64","v":3.5000000000000003E-2},{"$f":"'4. Hiti á efnisskilum'!AF65","v":30}]
[null,{"$f":"'4. Hiti á efnisskilum'!C64+'4. Hiti á efnisskilum'!C66","v":5.5E-2},{"$f":"'4. Hiti á efnisskilum'!G67","v":25.192307692307693},null,null,null,null,null,null,{"$f":"'4. Hiti á efnisskilum'!AB64+'4. Hiti á efnisskilum'!AB66","v":0.13500000000000001},{"$f":"'4. Hiti á efnisskilum'!AF67","v":29.628205128205128}]
[null,{"$f":"'4. Hiti á efnisskilum'!C64+'4. Hiti á efnisskilum'!C66+'4. Hiti á efnisskilum'!C68","v":0.155},{"$f":"'4. Hiti á efnisskilum'!G69","v":24.80769230769231},null,null,null,null,null,null,{"$f":"'4. Hiti á efnisskilum'!AB64+'4. Hiti á efnisskilum'!AB66+'4. Hiti á efnisskilum'!AB68","v":0.20898275862068968},{"$f":"'4. Hiti á efnisskilum'!AF69","v":15.874999999999998}]
[null,{"$f":"'4. Hiti á efnisskilum'!C64+'4. Hiti á efnisskilum'!C66+'4. Hiti á efnisskilum'!C68+'4. Hiti á efnisskilum'!C70","v":0.19950000000000001},{"$f":"'4. Hiti á efnisskilum'!G71","v":16.250000000000004},null,null,null,null,null,null,{"$f":"J5","v":0.20898275862068968},{"$f":"'4. Hiti á efnisskilum'!AF72","v":5}]
[null,{"$f":"'4. Hiti á efnisskilum'!C64+'4. Hiti á efnisskilum'!C66+'4. Hiti á efnisskilum'!C68+'4. Hiti á efnisskilum'!C70","v":0.19950000000000001},{"$f":"'4. Hiti á efnisskilum'!G74","v":5}]
[]
[]
[]
[]
[]
[]
[]
[]
{"$rows_left_out":8}