{"text_format":"1","workbook":"xlsx","n_sheets":14,"sheets":["1. Yfirlit","2. Orkurammi","3. Þykkt einangrunar","4. Hiti á efnisskilum","5. Gluggar&Hurðir","6. Orkubúskapur","7. Raki_rakamagn","8. Raki_mettunarþrýst","9. Alg. leiðnitölur","10. Veðurgögn","11. Raki_töflur","12. Gerðir","13. Leiðbeiningar","Tölur fyrir gröf"],"not_rendered":{"charts":13,"images":1,"macros":1,"external_links":1,"defined_names":71,"comments":8,"pivot_tables":0},"unopened":[],"bounds":{"document_bytes":16777216,"sheet_cells":100000,"rows_first":2000,"rows_last":500,"rows_between":2000,"halvings":0,"cell_chars":16384,"cell_head_chars":4096},"cells_cut":0,"cells_raw":0,"read":"whole","date_system":"1900"}

{"sheet":"1. Yfirlit","index":0,"n_rows":46,"n_cols":7,"rows_kept":46,"cut":false,"hidden":false,"merged":[[0,0,1,7]]}
[" Orkurammi - Yfirlit"]
[]
[]
[null,"Þak","Ureglugerð","Notað"]
[null,{"$f":"HYPERLINK(\"[\"&B46&\"]Létt_þak\",\"Létt þak\")","v":"Létt þak"},0.2]
[null,{"$f":"HYPERLINK(\"[\"&B46&\"]Uppstólað_þak_á_steypta_plötu\",\"Uppstólað þak á steypta plötu\")","v":"Uppstólað þak á steypta plötu"},0.2]
[null,{"$f":"HYPERLINK(\"[\"&B46&\"]Viðsnúið_þak\",\"Viðsnúið þak\")","v":"Viðsnúið þak"},0.2]
[null,{"$f":"HYPERLINK(\"[\"&B46&\"]Kalt_þak\",\"Kalt þak\")","v":"Kalt þak"},0.2]
[null,{"$f":"HYPERLINK(\"[\"&B46&\"]Þak_annað\",\"Annað\")","v":"Annað"},0.2]
[null,"Steyptir veggir"]
[null,{"$f":"HYPERLINK(\"[\"&B46&\"]Steyptur_veggur_einangraður_að_innan\",\"Steyptur veggur einangraður að innan\")","v":"Steyptur veggur einangraður að innan"},0.4]
[null,{"$f":"HYPERLINK(\"[\"&B46&\"]Steyptur_veggur_einangraður_að_utan\",\"Steyptur veggur einangraður að utan\")","v":"Steyptur veggur einangraður að utan"},0.4]
[null,{"$f":"HYPERLINK(\"[\"&B46&\"]Steyptur_veggur_annað\",\"Annað\")","v":"Annað"},0.4]
[null,"Léttir veggir"]
[null,{"$f":"HYPERLINK(\"[\"&B46&\"]Léttur_veggur\",\"Léttur veggur\")","v":"Léttur veggur"},0.3]
[null,{"$f":"HYPERLINK(\"[\"&B46&\"]Léttur_veggur_annað\",\"Annað\")","v":"Annað"},0.3]
[null,"Gólf"]
[null,{"$f":"HYPERLINK(\"[\"&B46&\"]Gólf_sökkull_með_innveggjum\",\"Gólf - Sökkull með innveggjum\")","v":"Gólf - Sökkull með innveggjum"},0.3]
[null,{"$f":"HYPERLINK(\"[\"&B46&\"]Steypt_gólf_með_gólfgeisla_tvöföld\",\"Steypt gólf með gólfgeisla (tvöföld einangrun)\")","v":"Steypt gólf með gólfgeisla (tvöföld einangrun)"},0.3]
[null,{"$f":"HYPERLINK(\"[\"&B46&\"]Steypt_gólf_með_gólfgeisla_einföld\",\"Steypt gólf með gólfgeisla (einföld einangrun)\")","v":"Steypt gólf með gólfgeisla (einföld einangrun)"},0.3]
[null,{"$f":"HYPERLINK(\"[\"&B46&\"]Gólf_annað\",\"Annað\")","v":"Annað"},0.3]
[null,"Gluggar"]
[null,{"$f":"HYPERLINK(\"[\"&B46&\"]Gluggar_Hurðir\",\"Vegið meðaltal glugga\")","v":"Vegið meðaltal glugga"},2]
[null,"Hurðir"]
[null,{"$f":"HYPERLINK(\"[\"&B46&\"]Gluggar_Hurðir\",\"Vegið meðaltal hurða\")","v":"Vegið meðaltal hurða"},2]
[]
[]
[]
[]
[]
[]
[]
[]
[]
[]
[]
[]
[]
[null,null,null,"Niðurstaða"]
[null,null,null,"Orkurammi",null,{"$f":"'2. Orkurammi'!D39","v":204},"W/K"]
[null,null,null,"Rauntap",null,{"$f":"'2. Orkurammi'!C42","v":196.36248614857828},"W/K"]
[null,null,null,"Leiðnitap á ferm. gólfs",null,{"$f":"'2. Orkurammi'!C46","v":0.98181243074289137},"W/m2°C"]
[null,null,null,"Útveggir,vegið meðaltal",null,{"$f":"'2. Orkurammi'!C48","v":0.56585332478409289},"W/m2K"]
[null,null,null,"Aflþörf",null,{"$f":"'6. Orkubúskapur'!B40","v":11632.687015200239},"W"]
[null,null,null,"Varmaþörf",null,{"$f":"'6. Orkubúskapur'!B42","v":42080.746733757653},"kWh/ár"]
[null,"Orkurammi_mini.xlsm"]

{"sheet":"2. Orkurammi","index":1,"n_rows":48,"n_cols":15,"rows_kept":48,"cut":false,"hidden":false,"merged":[[46,0,46,3],[12,0,13,0],[12,1,13,1],[10,8,10,9],[1,0,2,0],[1,1,2,1],[44,0,44,3],[8,7,8,9],[44,4,44,5],[19,12,19,14],[8,12,8,14],[5,13,5,14],[6,13,6,14],[2,7,2,14],[3,7,3,14],[4,13,4,14],[7,13,7,14]]}
["TAFLA 1  ORKURAMMI",null,null,null,null,null,null,"ATH! Gera þarf haus (header) á orkurammann. Hausinn sést ekki í normal view, til þess að sjá og uppfæra hausinn, "]
["Byggingarhluti","Lýsing","Flatarmál","U","U· A",null,null,"skal velja View og svo Page layout. Fylla svo inn á viðeigandi staði"]
[null,null,"A (m2)",null,null,null,null,"Athuga skal að nota skal töflurnar hér að neðan við gerð orkurammans, þar sem viðeigandi reitir í Orkurammanum uppfærast útfrá "]
[null,null,null,null,null,null,null,"töflunum. Aðeins skal slá inn í þá reiti orkurammans sem eru með bláum lit (s.s lengd kuldabrúa)"]
["Þak","Létt timburþak",{"$f":"N11","v":200},0.2,{"$f":"+C5*D5","v":40},null,null,null,null,null,null,null,null,"\"Loka\" U-gildi"]
["Steyptir veggir","180mm, steinað",{"$f":"N12","v":150},0.4,60,null,null,"ATH! Skjalið er stillt (print area) þannig að töflurnar hér að neðan",null,null,null,"ATH! Áður en orkuramminn er prentaður er góð",null,"Veljið af lista"]
["Léttir veggir","Ekki ",{"$f":"N13","v":0},0.3,0,null,null,"prentast ekki, heldur aðeins orkuramminn. Hægt er að breyta",null,null,null,"hugmynd að fjarlægja bláa litinn úr reitum (s.s",null,"Innsláttarreitir"]
["Gólf","120 mm plata á fyll.",{"$f":"N14","v":200},0.3,60,null,null,"því með því að velja page layout (clear print area/add to print area)",null,null,null,"reitum fyrir lýsingar og kuldabrýr), þ.e. nota \"No fill\"",null,"Einangrunarþykktir"]
["Gluggar/Hurðir",null,{"$f":"N15+N16","v":22},2,44,null,null,"Gerð einstakra byggingarhluta",null,null,null,null,"Flatarmál byggingarhluta"]
[null,null,null,null,null,null,null,"Gólf",null,null,null,null,"Byggingarhluti","Flatarmál (m2)"]
[null,null,"Orkurammi","Σ U· A",{"$f":"SUM(E5:E10)","v":204},null,null,"Veljið gólfgerð",null,null,null,null,"Þak",200]
["TAFLA 2 RAUNTAP GEGNUM HJÚP OG BOTNPLÖTU",null,null,null,null,null,null,"Gólf án gólfgeisla",{"$f":"INDEX(Gólfstuðlar,Valin_röð_gólf)","v":0.42857142857142855},"?",null,null,"Steyptir veggir",150]
["Byggingarhluti","Lýsing","Flatarmál","U","U· A","Einangrunarþ.",null,"Ef gólfgeisli, er einangrað undir geisla?","Nei",null,null,null,"Léttir veggir",0]
[null,null,"A (m2)",null,null,"mm",null,"Leiðrétt. vegna kuldabrúr undir innvegg",{"$f":"IF(I13=\"Nei\",45/35,1)","v":1.2857142857142858},null,null,null,"Gólf (Botnplata)",200]
[null,null,null,null,null,null,null,null,null,null,null,null,"Gluggar ",18]
["Þak",{"$f":"B5","v":"Létt timburþak"},{"$f":"N11","v":200},{"$f":"N22","v":0.20000000000000007},{"$f":"+C16*D16","v":40.000000000000014},{"$f":"O22","v":211.70142857142855},null,"Gluggar",null,null,null,null,"Hurðir",4]
["Steyptir veggir",{"$f":"B6","v":"180mm, steinað"},{"$f":"N12","v":150},{"$f":"N24","v":0.4},{"$f":"+C17*D17","v":60},{"$f":"O24","v":85.887357142857141},null,"Er U-gildi glugga þekkt fyrirfram (Já/Nei)","Nei",null,null,null,"Heildarfermetrafjöldi gólfs",200]
["Léttir veggir",{"$f":"B7","v":"Ekki "},{"$f":"N13","v":0},{"$f":"N26","v":0.3},{"$f":"+C18*D18","v":0},{"$f":"O26","v":132.99610837438425},null,"Ef Já, sláðu inn U-gildi glugga",null,null,null,"ATH! Lengd kuldabrúa þarf að slá inn hverja fyrir sig í Töflu 3:"]
["Gólf",{"$f":"B8","v":"120 mm plata á fyll."},{"$f":"N14","v":200},{"$f":"N28","v":0.3},{"$f":"IF(H12=\"Önnur\",(C19*D19)*J12,(C19*D19)*I12)","v":25.714285714285712},{"$f":"O28","v":144.44220934316823},null,null,null,null,null,"Tap gegnum kuldabrýr til vinstri"]
["Gluggar",null,18,{"$f":"IF(I17=\"Já\",I18,I26)","v":1.7040936948624805},30.67368650752465,null,null,"Ef Nei, veldu glergerðir að neðan:",null,null,null,null,"Veljið gerð byggingarhluta"]
["Hurðir",null,4,{"$f":"IF(I29=\"Já\",I30,I38)","v":1.6632713388348319},6.6530853553393277,null,null,"Veljið glergerð (fast gler)","U - gildi",null,null,null,"Þak","U - gildi","Ein. Þykkt [mm]"]
[null,null,null,null,null,null,null,"TopN+ (16 mm gasfyllt bil)",{"$f":"INDEX(Gluggar_Ugildi,'12. Gerðir'!$A$20)","v":1.1000000000000001},"?",null,null,"Létt þak",{"$f":"INDEX(Þak_Ugildi,'12. Gerðir'!$A$45)","v":0.20000000000000007},{"$f":"INDEX(Þak_einþykkt,'12. Gerðir'!A45)","v":211.70142857142855}]
[null,null,"Rauntap","Σ U· A",{"$f":"SUM(E16:E22)","v":163.0410575771497},null,null,"Veljið glergerð (opnanlegt fag)",null,null,null,null,"Steyptir veggir"]
["TAFLA 3 TAP GEGNUM KULDABRÝR",null,null,null,null,null,null,"K gler (12 mm loftbil)",{"$f":"INDEX(Gluggar_Ugildi,'12. Gerðir'!A21)","v":1.9},"?",null,null,"Steyptur veggur einangraður að innan",{"$f":"INDEX(Steyptir_veggir_Ugildi,'12. Gerðir'!$A$51)","v":0.4},{"$f":"INDEX(Steyptir_veggir_einþykkt,'12. Gerðir'!A51)","v":85.887357142857141}]
["Kuldabrýr",null,"Lengd L","ψ(W/mK)","ψ·L (W/K)",null,null,null,null,null,null,null,"Léttir veggir"]
[null,null,null,null,null,null,null,"Vegið U-gildi glugga",{"$f":"'5. Gluggar&Hurðir'!G43","v":1.7040936948624805},null,null,null,"Léttur veggur",{"$f":"INDEX(Léttir_veggir_Ugildi,'12. Gerðir'!$A$56)","v":0.3},{"$f":"INDEX(Léttir_veggir_einþykkt,'12. Gerðir'!A56)","v":132.99610837438425}]
["Lóðréttar kuldabrýr við úthorn",null,12,0.04,{"$f":"+C27*D27","v":0.48},null,null,null,null,null,null,null,"Gólf"]
["Láréttar kuldabrýr við plötuskil",null,0,0.83,{"$f":"+C28*D28","v":0},null,null,"Hurðir",null,null,null,null,"Gólf - Sökkull með innveggjum",{"$f":"INDEX(Gólf_Ugildi,'12. Gerðir'!$A$63)","v":0.3},{"$f":"INDEX(Gólf_einþykkt,'12. Gerðir'!A63)","v":144.44220934316823}]
["Lóðréttar kuldabrýr við útvegg/innvegg",null,9,0.83,{"$f":"+C29*D29","v":7.47},null,null,"Er U-gildi hurða þekkt fyrirfram (Já/Nei)","Nei",null,null,"ATH! Allar uppfærslur á töflunni hér að ofan skal gera í skjalinu \"Þykkt einangrunar\". "]
["Kuldabrýr við svalir",null,0,0.83,0,null,null,"Ef Já, sláðu inn U-gildi hurða",null,null,null,"U-gildi vísa í töflur í skjalinu Þykkt einangrunar og uppfærast sjálfkrafa"]
["Kuldabrýr útistigi-útveggur",null,0,0.6,0,null,null,null,null,null,null,"samfara breytingum sem eru gerðar á því skjal. Best er að nota flýtivísana"]
["Kuldabrýr við glugga",null,20,0.04,0.8,null,null,"Ef nei, veldu gerðir að neðan",null,null,null,"í skjalinu Yfirlit til þess að komast á viðeigandi stað í skjalinu"]
["Kuldabrýr við hurðir",null,10,0.04,0.4,null,null,"Veljið gerð aðalhurðar","U - gildi",null,null,"Þykkt einangrunar. (T.d. Ef valið er valmöguleikinn \"Annað\" er nauðsynlegt að uppfæra U-gildi og"]
["Sökkull undir útvegg",null,60,0.48,{"$f":"IF(H12=\"Önnur\",(C34*D34)*J12,(C34*D34)*I12)","v":12.342857142857142},null,null,"Aðalhurð glerjuð að hluta",{"$f":"INDEX(Hurðir_Ugildi,'12. Gerðir'!A29)","v":1.564339580040641},1.4,null,"þykkt í skjalinu Þykkt einangrunar en EKKI skrifa þau beint inn í reitina í töflunni að ofan)"]
["Sökkull undir innvegg",null,20,0.46,{"$f":"(C35*D35)*I14","v":11.828571428571431},null,null,"Veljið gerð svalahurðar"]
["Aðrar",null,0,null,{"$f":"C36*D36","v":0},null,null,"Svalahurð (0,9*2,05) - Ghlutf c.a. 52 %",{"$f":"INDEX(Svalahurðir_Ugildi,'12. Gerðir'!A34)","v":1.7820162601626017},1]
[null,null,"Kuldabrýr","Σ ψ· L",{"$f":"SUM(E27:E36)","v":33.321428571428569}]
[null,null,null,null,null,null,null,"Vegið U-gildi hurða",{"$f":"'5. Gluggar&Hurðir'!G51","v":1.6632713388348319}]
["ORKURAMMI ( Tafla 1)",null,null,{"$f":"+E11","v":204},"Krafa"]
["RAUNTAP GEGNUM HJÚP OG BOTNPLÖTU (Tafla 2)",null,{"$f":"+E23","v":163.0410575771497}]
["TAP GEGNUM KULDABRÝR (Tafla 3)",null,{"$f":"+E37","v":33.321428571428569}]
[null,"Tafla 2+3",{"$f":"SUM(C40:C41)","v":196.36248614857828},"Raun"]
[null,"Er   Krafa/Raun>1,0 ?",{"$f":"D39/C42","v":1.0388949742958682},{"$f":"IF(C43>0.995,\"Í lagi\",\"Ekki í lagi !\")","v":"Í lagi"}]
[]
["Grein 13.2.4",null,null,null,"U- gildi gluggaglerja"]
["Leiðnitap á fermetra gólfs pr. ",null,{"$f":"C42/N17","v":0.98181243074289137},null,"Fast gler",{"$f":"I22","v":1.1000000000000001}]
["Grein 13.3.2",null,null,null,"Opnanlegt fag",{"$f":"I24","v":1.9}]
["Útveggir, vegið meðaltal ",null,{"$f":"((C17*D17+C18*D18+C20*D20+C21*D21)/(C17+C18+C20+C21))","v":0.56585332478409289},{"$f":"IF(C48>0.85,\"Ekki í lagi !\",\"Í lagi\")","v":"Í lagi"}]

{"sheet":"3. Þykkt einangrunar","index":2,"n_rows":686,"n_cols":9,"rows_kept":686,"cut":false,"hidden":false,"merged":[[660,3,660,8],[412,3,412,8],[467,3,467,8],[298,5,300,8],[352,5,354,8],[514,3,514,8],[554,3,554,8],[602,3,602,8],[409,5,411,8],[464,5,466,8],[2,5,4,8],[91,5,93,8],[136,5,138,8],[191,5,193,8],[244,5,246,8],[247,3,247,8],[5,3,5,8],[355,3,355,8],[44,3,44,8],[94,3,94,8],[139,3,139,8],[194,3,194,8],[301,3,301,8],[41,5,43,8]]}
[]
[]
[null,null,null,"Er einangrunarþykkt vituð? (Já/Nei)","Nei","Taflan reiknar út einangrunarþykkt og U gildi, eða U gildi ef einangrunarþykkt er vituð"]
[null,null,null,"Ef Já, hver er einangrunarþykktin (m) ?","?"]
[]
[null,null,null,"Steyptur veggur einangraður að innan"]
[null,null,null,null,null,null,"d","λ","R"]
[null,null,null,null,null,null,"m","W/mK"]
[null,null,null,"Ytra yfirborð",null,null,null,null,0.04]
[null,null,null,"Marmarasalli",null,null,1E-3,3,{"$f":"+G10/H10","v":3.3333333333333332E-4}]
[null,null,null,"Múrhúð",null,null,0.02,1.4,{"$f":"+G11/H11","v":1.4285714285714287E-2}]
[null,null,null,"Járnbent steinsteypa",null,null,0.18,1.95,{"$f":"+G12/H12","v":9.2307692307692313E-2}]
[null,null,null,"Frauðplast",null,null,{"$f":"(I19-SUM(I9:I12)-SUM(I14:I15))*H13","v":8.588735714285714E-2},3.9E-2,{"$f":"IF(E3=\"Já\",E4/H13,G13/H13)","v":2.2022399267399266}]
[null,null,null,"Múrhúð",null,null,2.5000000000000001E-2,1.2,{"$f":"+G14/H14","v":2.0833333333333336E-2}]
[null,null,null,"Innra yfirborð",null,null,null,null,0.13]
[null,null,null,"Alls (∑R)",null,null,null,null,{"$f":"SUM(I9:I15)","v":2.5}]
[null,null,null,"U=",null,null,null,null,{"$f":"1/I16","v":0.4}]
[null,null,null,"Rstaðall",null,null,null,null,{"$f":"1/'2. Orkurammi'!D6","v":2.5}]
[null,null,null,"Rnauðsyn",null,null,null,null,{"$f":"1/'2. Orkurammi'!D6-0","v":2.5}]
[null,null,null,"Samtals U",{"$f":"I17","v":0.4},{"$f":"IF(E20>0.4049,\"Ekki í lagi\",\"Í lagi\")","v":"Í lagi"}]
[]
[null,null,null,"Einangrunarþykkt",null,{"$f":"IF(E3=\"Já\",E4*1000,G13*1000)","v":85.887357142857141},"mm"]
[]
[]
[]
[]
[]
[]
[]
[]
[]
[]
[]
[]
[]
[]
[]
[]
[]
[]
[]
[null,null,null,"Er einangrunarþykkt vituð? (Já/Nei)","Nei","Taflan reiknar út einangrunarþykkt og U gildi, eða U gildi ef einangrunarþykkt er vituð"]
[null,null,null,"Ef Já, hver er einangrunarþykktin? (m)","?"]
[]
[null,null,null,"Steyptur veggur einangraður að utan"]
[null,null,null,null,null,null,"d","λ","R"]
[null,null,null,null,null,null,"m","W/mK"]
[null,null,null,"Ytra yfirborð",null,null,null,null,0.13]
[null,null,null,"Klæðning",null,null,0.02,0.16,"-"]
[null,null,null,"Loftræst bil (mikið)",null,null,0.02,null,"-"]
[null,null,null,"Steinull, veggplata",null,null,{"$f":"(I66-SUM(I48:I50)-SUM(I52:I55))*H51","v":0.12228461538461539},3.5000000000000003E-2,{"$f":"IF(E42=\"Já\",E43/H51,G51/H51)","v":3.4938461538461536}]
[null,null,null,"Vinklar"]
[null,null,null,"Dýflur"]
[null,null,null,"Járnbent steinsteypa",null,null,0.18,1.95,{"$f":"G54/H54","v":9.2307692307692313E-2}]
[null,null,null,"Innra yfirborð",null,null,null,null,0.13]
[null,null,null,"Alls (∑R)",null,null,null,null,{"$f":"SUM(I48:I55)","v":3.8461538461538458}]
[]
[null,null,null,"U=",null,null,null,null,{"$f":"1/I56","v":0.26}]
[null,null,null,"ΔU(Einangrað í heilu lagi)",null,null,null,null,0.01]
[null,null,null,"Kólnunartala U",null,null,null,null,{"$f":"I58+I59","v":0.27}]
[null,null,null,"Rstaðall=",null,null,null,null,{"$f":"1/'2. Orkurammi'!D6","v":2.5}]
[null,null,null,"Punktkuldabrýr:"]
[null,null,null,"Vinklar (ΔUf1)",null,null,null,17,0.12]
[null,null,null,"Dýflur (ΔUf2)",null,null,null,17,0.01]
[]
[null,null,null,"Rnauðsyn=",null,null,null,null,{"$f":"1/('2. Orkurammi'!D6-(I59+I63+I64))","v":3.8461538461538458}]
[null,null,null,"Samtals U",{"$f":"I58+I59+I63+I64","v":0.4},{"$f":"IF(E67>0.4049,\"Ekki í lagi\",\"Í lagi\")","v":"Í lagi"}]
[]
[null,null,null,"Einangrunarþykkt",null,{"$f":"IF(E42=\"Já\",E43*1000,G51*1000)","v":122.28461538461539},"mm"]
[]
[]
[]
[]
[]
[]
[]
[]
[]
[]
[]
[]
[]
[]
[]
[]
[]
[]
[]
[]
[]
[]
[null,null,null,"Er einangrunarþykkt vituð? (Já/Nei)","Nei","Taflan reiknar út einangrunarþykkt og U gildi, eða U gildi ef einangrunarþykkt er vituð"]
[null,null,null,"Ef Já, hver er einangrunarþykktin (m) ?","?"]
[]
[null,null,null,"Létt þak"]
[null,null,null,null,null,null,"d","λ","R"]
[null,null,null,null,null,null,"m","W/mK"]
[null,null,null,"Ytra yfirborð",null,null,null,null,0]
[null,null,null,"Klæðning",null,null,null,null,0.15]
[null,null,null,"Loftræst loftbil(lítið)",null,null,0.02,1.4,0.08]
[null,null,null,"Sperrur+einangrun",null,null,{"$f":"(I108-SUM(I98:I100)-SUM(I102:I104))*H101","v":0.21170142857142854},4.7E-2,{"$f":"IF(E92=\"Já\",E93/H101,G101/H101)","v":4.5042857142857136}]
[null,null,null,"Loftbil",null,null,null,0,0.08]
[null,null,null,"Loftaklæðning",null,null,1.2E-2,0.14000000000000001,{"$f":"+G103/H103","v":8.5714285714285701E-2}]
[null,null,null,"Innra yfirborð",null,null,null,null,0.1]
[null,null,null,"Alls (∑R)",null,null,null,null,{"$f":"SUM(I98:I104)","v":4.9999999999999982}]
[null,null,null,"U=",null,null,null,null,{"$f":"1/I105","v":0.20000000000000007}]
[null,null,null,"Rstaðall",null,null,null,null,{"$f":"1/'2. Orkurammi'!D5","v":5}]
[null,null,null,"Rnauðsyn",null,null,null,null,{"$f":"1/'2. Orkurammi'!D5-0","v":5}]
[null,null,null,"Samtals U",{"$f":"I106","v":0.20000000000000007},{"$f":"IF(E109>0.2049,\"Ekki í lagi\",\"Í lagi\")","v":"Í lagi"}]
[]
[null,null,null,"Einangrunarþykkt",null,{"$f":"IF(E92=\"Já\",E93*1000,G101*1000)","v":211.70142857142855},"mm"]
[]
[]
[]
[]
[]
[]
[]
[]
[]
[]
[]
[]
[]
[]
[]
[]
[]
[]
[]
[]
[]
[]
[]
[]
[]
[null,null,null,"Er einangrunarþykkt vituð? (Já/Nei)","Nei","Taflan reiknar út einangrunarþykkt og U gildi, eða U gildi ef einangrunarþykkt er vituð"]
[null,null,null,"Ef Já, hver er einangrunarþykktin (m) ?",0.2]
[]
[null,null,null,"Viðsnúið þak"]
[null,null,null,null,null,null,"d","λ","R"]
[null,null,null,null,null,null,"m","W/mK"]
[null,null,null,"Ytra yfirborð",null,null,null,null,0.04]
[null,null,null,"Hellur",null,null,0.05,1.4,{"$f":"G144/H144","v":3.5714285714285719E-2}]
[null,null,null,"Sandur",null,null,0.03,1.5,{"$f":"G145/H145","v":0.02}]
[null,null,null,"Jarðvegsfilt",null,null,5.0000000000000001E-3,0.52,9.6153846153846159E-3]
[null,null,null,"Einangrun (XPS) - Tvö lög",null,null,{"$f":"(I157-SUM(I143:I146)-SUM(I148:I151))*H147","v":0.24973124542124542},3.4000000000000002E-2,{"$f":"IF(E137=\"Já\",E138/H147,G147/H147)","v":7.3450366300366294}]
[null,null,null,"Asfaltpappi - Tvö lög",null,null,0.01,0.26,3.8461538461538464E-2]
[null,null,null,"Ílögn",null,null,0.03,1.4,2.1428571428571429E-2]
[null,null,null,"Steypt plata (járnbent)",null,null,0.16,1.95,8.2051282051282051E-2]
[null,null,null,"Innra yfirborð",null,null,null,null,0.1]
[null,null,null,"Alls (∑R)",null,null,null,null,{"$f":"SUM(I143:I151)","v":7.6923076923076907}]
[]
[null,null,null,"Rstaðall",null,null,null,null,{"$f":"1/'2. Orkurammi'!D5","v":5}]
[null,null,null,"U=",null,null,null,null,{"$f":"1/I152","v":0.13000000000000003}]
[null,null,null,"ΔUr",null,null,null,null,7.0000000000000007E-2]
[null,null,null,"Rnauðsyn",null,null,null,null,{"$f":"1/('2. Orkurammi'!D5-('3. Þykkt einangrunar'!I156))","v":7.6923076923076916}]
[null,null,null,"Samtals U",{"$f":"I155+I156","v":0.20000000000000004},{"$f":"IF(E158>0.2049,\"Ekki í lagi\",\"Í lagi\")","v":"Í lagi"}]
[]
[null,null,null,"Einangrunarþykkt",null,{"$f":"IF(E137=\"Já\",E138*1000,G147*1000)","v":249.7312454212454},"mm"]
[]
[]
[]
[]
[]
[]
[]
[]
[]
[]
[]
[]
[]
[]
[]
[]
[]
[]
[]
[]
[]
[]
[]
[]
[]
[]
[]
[]
[]
[]
[]
[null,null,null,"Er einangrunarþykkt vituð? (Já/Nei)","Nei","Taflan reiknar út einangrunarþykkt og U gildi, eða U gildi ef einangrunarþykkt er vituð"]
[null,null,null,"Ef Já, hver er einangrunarþykktin (m) ?","?"]
[]
[null,null,null,"Uppstólað þak á  steypta plötu"]
[null,null,null,null,null,null,"d","λ","R"]
[null,null,null,null,null,null,"m","W/mK"]
[null,null,null,"Ytra yfirborð"]
[null,null,null,"Klæðning + loftbil",null,null,null,null,0.3]
[null,null,null,"Uppstólun + steinull",null,null,0.15,0.04,0]
[null,null,null,"Reim + steinull",null,{"$f":"(I208-SUM(I199:I200)-SUM(I202:I204))*H201","v":0.22056282051282053},0.05,4.9000000000000002E-2,{"$f":"IF(E192=\"Já\",E193/H201,F201/H201)","v":4.5012820512820513}]
[null,null,null,"Steypt plata (járnbent)",null,null,0.16,1.95,{"$f":"G202/H202","v":8.2051282051282051E-2}]
[null,null,null,"Múrhúð",null,null,0.02,1.2,1.6666666666666666E-2]
[null,null,null,"Innri yfirborð",null,null,null,null,0.1]
[null,null,null,"Alls (∑R)",null,null,null,null,{"$f":"SUM(I199:I204)","v":4.9999999999999991}]
[]
[null,null,null,"Rstaðall",null,null,null,null,{"$f":"1/'2. Orkurammi'!D5","v":5}]
[null,null,null,"Rnauðsyn",null,null,null,null,{"$f":"1/'2. Orkurammi'!D5-0","v":5}]
[null,null,null,"Samtals U",{"$f":"1/I205","v":0.20000000000000004},{"$f":"IF(E209>0.2049,\"Ekki í lagi\",\"Í lagi\")","v":"Í lagi"}]
[]
[null,null,null,"Einangrunarþykkt",null,{"$f":"IF(E192=\"Já\",E193*1000,F201*1000)","v":220.56282051282054},"mm"]
[null,null,null,"Ath breyta í 1 lag ???"]
[null,null,null,"0,221 ef lögin eru tekin saman"]
[]
[]
[]
[]
[]
[]
[]
[]
[]
[]
[]
[]
[]
[]
[]
[]
[]
[]
[]
[]
[]
[]
[]
[]
[]
[]
[]
[]
[]
[]
[]
[null,null,null,"Er einangrunarþykkt vituð? (Já/Nei)","Nei","Taflan reiknar út einangrunarþykkt og U gildi, eða U gildi ef einangrunarþykkt er vituð"]
[null,null,null,"Ef Já, hver er einangrunarþykktin (m) ?","?"]
[]
[null,null,null,"Kalt þak"]
[null,null,null,null,null,null,"d","λ","R"]
[null,null,null,null,null,null,"m","W/mK"]
[null,null,null,"Ytra yfirborð"]
[null,null,null,"Pappi - tvö lög",null,null,null,null,0.15]
[null,null,null,"Steypt plata (járnbent)",null,null,0.16,1.95]
[null,null,null,"Loftræst loftbil (lítið)",null,null,0.2,null,0.08]
[null,null,null,"Steinull - samfelld",null,{"$f":"(I263-SUM(I252:I254)-SUM(I257:I259))*H255","v":0.17566714285714283},0.1,3.9E-2,{"$f":"IF(E245=\"Já\",E246/H255,F255/H255)","v":4.5042857142857136}]
[null,null,null,"Grind - steinull",null,null,0.1,4.7E-2,0]
[null,null,null,"Loftbil",null,null,null,null,0.08]
[null,null,null,"Loftaklæðning (spónaplötur)",null,null,1.2E-2,0.14000000000000001,{"$f":"G258/H258","v":8.5714285714285701E-2}]
[null,null,null,"Innri yfirborð",null,null,null,null,0.1]
[null,null,null,"Alls (∑R)",null,null,null,null,{"$f":"SUM(I252:I259)","v":4.9999999999999982}]
[null,null,null,"U=",null,null,null,null,{"$f":"1/I260","v":0.20000000000000007}]
[null,null,null,"Rstaðall",null,null,null,null,{"$f":"1/'2. Orkurammi'!D5","v":5}]
[null,null,null,"Rnauðsyn",null,null,null,null,{"$f":"1/'2. Orkurammi'!D5-0","v":5}]
[null,null,null,"Samtals U",{"$f":"I261","v":0.20000000000000007},{"$f":"IF(E264>0.2049,\"Ekki í lagi\",\"Í lagi\")","v":"Í lagi"}]
[]
[null,null,null,"Einangrunarþykkt",null,{"$f":"IF(E245=\"Já\",E246*1000,F255*1000)","v":175.66714285714284},"mm"]
[null,null,null,"Ath breyta í 1 lag ???"]
[null,null,null,"0,176 ef lögin eru tekin saman"]
[]
[]
[]
[]
[]
[]
[]
[]
[]
[]
[]
[]
[]
[]
[]
[]
[]
[]
[]
[]
[]
[]
[]
[]
[]
[]
[]
[]
[]
[]
[null,null,null,"Er einangrunarþykkt vituð? (Já/Nei)","Nei","Taflan reiknar út einangrunarþykkt og U gildi, eða U gildi ef einangrunarþykkt er vituð"]
[null,null,null,"Ef Já, hver er einangrunarþykktin (m) ?","?"]
[]
[null,null,null,"Léttur veggur "]
[null,null,null,null,null,null,"d","λ","R"]
[null,null,null,null,null,null,"m","W/mK"]
[null,null,null,"Ytra yfirborð"]
[null,null,null,"Klæðning",null,null,2.2200000000000001E-2,0.16,0.15]
[null,null,null,"Loftræst bil (lítið)",null,null,0.01,null,0.08]
[null,null,null,"Krossviður",null,null,8.9999999999999993E-3,0.14000000000000001,{"$f":"G308/H308","v":6.4285714285714279E-2}]
[null,null,null,"Stoðir+einangrun",null,null,{"$f":"(I318-SUM(I306:I308)-SUM(I310:I312))*H309","v":0.13299610837438425},4.7E-2,{"$f":"IF(E299=\"Já\",E300/H309,G309/H309)","v":2.829704433497537}]
[null,null,null,"Loftbil",null,null,null,null,0.08]
[null,null,null,"Klæðning (spónaplötur)",null,null,1.6E-2,0.14000000000000001,{"$f":"G311/H311","v":0.11428571428571428}]
[null,null,null,"Innri mótstaða",null,null,null,null,0.13]
[null,null,null,"Alls (∑R)",null,null,null,null,{"$f":"SUM(I306:I312)","v":3.4482758620689657}]
[]
[null,null,null,"Rstaðall",null,null,null,null,{"$f":"1/'2. Orkurammi'!D7","v":3.3333333333333335}]
[null,null,null,"U=",null,null,null,null,{"$f":"1/I313","v":0.28999999999999998}]
[null,null,null,"ΔU(Einangrað í heilu lagi)",null,null,null,null,0.01]
[null,null,null,"Rnauðsyn",null,null,null,null,{"$f":"1/('2. Orkurammi'!D7-('3. Þykkt einangrunar'!I317))","v":3.4482758620689657}]
[null,null,null,"Samtals U",{"$f":"I316+I317","v":0.3},{"$f":"IF(E319>0.3049,\"Ekki í lagi\",\"Í lagi\")","v":"Í lagi"}]
[]
[null,null,null,"Einangrunarþykkt",null,{"$f":"IF(E299=\"Já\",E300*1000,G309*1000)","v":132.99610837438425},"mm"]
[]
[]
[]
[]
[]
[]
[]
[]
[]
[]
[]
[]
[]
[]
[]
[]
[]
[]
[]
[]
[]
[]
[]
[]
[]
[]
[]
[]
[]
[]
[]
[null,null,null,"Er einangrunarþykkt vituð? (Já/Nei)","Nei","Taflan reiknar út einangrunarþykkt og U gildi, eða U gildi ef einangrunarþykkt er vituð"]
[null,null,null,"Ef Já, hver er einangrunarþykktin (m) ?","?"]
[]
[null,null,null,"Gólf - Sökkull með innveggjum"]
[null,null,null,null,null,null,"d","λ","R"]
[null,null,null,null,null,null,"m","W/mK"]
[null,null,null,"Ytra yfirborð",null,null,null,null,0.17]
[null,null,null,"Parket",null,null,0,0.17,{"$f":"+G360/H360","v":0}]
[null,null,null,"Gólfplata",null,null,0.1,1.95,{"$f":"+G361/H361","v":5.1282051282051287E-2}]
[null,null,null,"Einangrun",null,null,{"$f":"(I370-SUM(I359:I361)-SUM(I363))*H362","v":0.14444220934316823},4.7E-2,{"$f":"IF(E353=\"Já\",E354/H362,G362/H362)","v":3.0732384966631541}]
[null,null,null,"Jarðvegur",null,null,null,3.9E-2,1.5]
[null,null,null,"Alls (∑R)",null,null,null,null,{"$f":"SUM(I359:I363)","v":4.794520547945206}]
[]
[null,null,null,"U=",null,null,null,null,{"$f":"1/I364","v":0.20857142857142855}]
[null,null,null,"ΔU(Einangrað í heilu lagi)",null,null,null,null,0.01]
[null,null,null,"Kólnunartala U",null,null,null,null,{"$f":"SUM(I366:I367)","v":0.21857142857142856}]
[null,null,null,"Rstaðall=",null,null,null,null,{"$f":"1/'2. Orkurammi'!D19","v":3.3333333333333335}]
[null,null,null,"Rnauðsyn=",null,null,null,null,{"$f":"1/('2. Orkurammi'!D8-(I367+I375+I376))","v":4.7945205479452051}]
[]
[null,null,null,"Einangrunarþykkt",null,{"$f":"IF(E353=\"Já\",E354*1000,G362*1000)","v":144.44220934316823},"mm"]
[]
[null,null,null,"Línukuldabrýr:","L (m)","ψ(W/mK)","L.itap W/K",null," ΔT=15"]
[null,null,null,"Kuldabrú útveggir",60,0.48,{"$f":"+E375*F375","v":28.799999999999997},{"$f":"+G375/'2. Orkurammi'!$C$19","v":0.14399999999999999},{"$f":"+H375*15/35","v":6.1714285714285708E-2}]
[null,null,null,"Kuldabrú innveggir",20,0.46,{"$f":"+E376*F376","v":9.2000000000000011},{"$f":"+G376/'2. Orkurammi'!$C$19","v":4.6000000000000006E-2},{"$f":"+H376*15/35","v":1.9714285714285715E-2}]
[]
[null,null,null,"Samtals U",{"$f":"+I376+I375+I368","v":0.3},{"$f":"IF(E378>0.3049,\"Ekki í lagi\",\"Í lagi\")","v":"Í lagi"}]
[]
[]
[]
[]
[]
[]
[]
[]
[]
[]
[]
[]
[]
[]
[]
[]
[]
[]
[]
[]
[]
[]
[]
[]
[]
[]
[]
[]
[]
[]
[]
[null,null,null,"Er einangrunarþykkt vituð? (Já/Nei)","Nei","Taflan reiknar út einangrunarþykkt og U gildi, eða U gildi ef einangrunarþykkt er vituð"]
[null,null,null,"Ef Já, hver er einangrunarþykktin (m) ?","?"]
[]
[null,null,null,"Steypt gólf með gólfgeisla"]
[null,null,null,null,null,null,"d","λ","R"]
[null,null,null,null,null,null,"m","W/mK"]
[null,null,null,"Innra yfirborð"]
[null,null,null,"Gólfefni + ílögn m/gólflögnum",null,null,{"$f":"0.035","v":3.5000000000000003E-2},1.2]
[null,null,null,"Gólfplata",null,null,0.1,1.95,{"$f":"G418/H418","v":5.1282051282051287E-2}]
[null,null,null,"Frauðplasteinangrun",null,null,{"$f":"(I426-SUM(I417:I418)-SUM(I420))*H419","v":7.3982758620689676E-2},3.9E-2,{"$f":"IF(E410=\"Já\",E411/H419,G419/H419)","v":1.8969938107869149}]
[null,null,null,"Jarðvegur",null,null,null,null,1.5]
[null,null,null,"Alls (∑R)",null,null,null,null,{"$f":"SUM(I417:I420)","v":3.4482758620689662}]
[]
[null,null,null,"Rstaðall",null,null,null,null,{"$f":"1/'2. Orkurammi'!D8","v":3.3333333333333335}]
[null,null,null,"U=",null,null,null,null,{"$f":"1/I421","v":0.28999999999999992}]
[null,null,null,"ΔU(Einangrað í heilu lagi)",null,null,null,null,0.01]
[null,null,null,"Rnauðsyn",null,null,null,null,{"$f":"1/('2. Orkurammi'!D8-I425)","v":3.4482758620689657}]
[null,null,null,"Samtals U",{"$f":"I424+I425","v":0.29999999999999993},{"$f":"IF(E427>0.3049,\"Ekki í lagi\",\"Í lagi\")","v":"Í lagi"}]
[]
[null,null,null,"Einangrunarþykkt",null,{"$f":"IF(E410=\"Já\",E411*1000,G419*1000)","v":73.98275862068968},"mm"]
[]
[]
[]
[]
[]
[]
[]
[]
[]
[]
[]
[]
[]
[]
[]
[]
[]
[]
[]
[]
[]
[]
[]
[]
[]
[]
[]
[]
[]
[]
[]
[]
[]
[]
[]
[null,null,null,"Er einangrunarþykkt vituð? (Já/Nei)","Nei","Taflan reiknar út einangrunarþykkt og U gildi, eða U gildi ef einangrunarþykkt er vituð"]
[null,null,null,"Ef Já, hver er einangrunarþykktin (m) ?","?"]
[]
[null,null,null,"Steypt gólf með gólfgeisla (Tvöföld einangrun)"]
[null,null,null,null,null,null,"d","λ","R"]
[null,null,null,null,null,null,"m","W/mK"]
[null,null,null,"Innra yfirborð"]
[null,null,null,"Gólfefni + Anhydrit ílögn m/gólflögnum",null,null,0.03,1.2]
[null,null,null,"Frauðplasteinangrun",null,null,2.5000000000000001E-2,3.9E-2,{"$f":"G473/H473","v":0.64102564102564108}]
[null,null,null,"Gólfplata",null,null,0.1,1.95,{"$f":"G474/H474","v":5.1282051282051287E-2}]
[null,null,null,"Frauðplasteinangrun",null,null,{"$f":"(I481-SUM(I472:I474)-SUM(I476))*H475","v":4.4499999999999998E-2},3.9E-2,{"$f":"IF(E465=\"Já\",E466/H475,G475/H475)","v":1.141025641025641}]
[null,null,null,"Jarðvegur",null,null,null,null,1.5]
[null,null,null,"Alls (∑R)",null,null,null,null,{"$f":"SUM(I471:I476)","v":3.3333333333333335}]
[]
[null,null,null,"Rstaðall",null,null,null,null,{"$f":"1/'2. Orkurammi'!D8","v":3.3333333333333335}]
[null,null,null,"U=",null,null,null,null,{"$f":"1/I477","v":0.3}]
[null,null,null,"Rnauðsyn",null,null,null,null,{"$f":"1/('2. Orkurammi'!D8-0)","v":3.3333333333333335}]
[null,null,null,"Samtals U",{"$f":"I480","v":0.3},{"$f":"IF(E482>0.3049,\"Ekki í lagi\",\"Í lagi\")","v":"Í lagi"}]
[]
[null,null,null,"Einangrunarþykkt",null,{"$f":"IF(E465=\"Já\",E466*1000,G475*1000)","v":44.5},"mm"]
[null,null,null,"ATH þykkt "]
[null,null,null,"Ath hvort rétt sé að nota 0,039"]
[]
[]
[]
[]
[]
[]
[]
[]
[]
[]
[]
[]
[]
[]
[]
[]
[]
[]
[]
[]
[]
[]
[]
[]
[]
[]
[]
[]
[null,null,null,"Þak"]
[null,null,null,null,null,null,"d","λ","R"]
[null,null,null,null,null,null,"m","W/mK"]
[null,null,null,"Ytra yfirborð"]
[]
[]
[]
[]
[]
[]
[null,null,null,"Innra yfirborð"]
[null,null,null,"Alls (∑R)",null,null,null,null,{"$f":"SUM(I518:I525)","v":0}]
[null,null,null,"U=",null,null,null,null,{"$f":"1/I526","v":{"$error":"#DIV/0!"}}]
[null,null,null,"Rstaðall",null,null,null,null,{"$f":"1/'2. Orkurammi'!D5","v":5}]
[null,null,null,"Rnauðsyn",null,null,null,null,{"$f":"1/'2. Orkurammi'!D5-0","v":5}]
[null,null,null,"……."]
[null,null,null,"Samtals U",{"$f":"I527+0","v":{"$error":"#DIV/0!"}},{"$f":"IF(E531>0.2049,\"Ekki í lagi\",\"Í lagi\")","v":{"$error":"#DIV/0!"}}]
[]
[null,null,null,"Einangrunarþykkt",null,{"$f":"+G522*1000","v":0},"mm"]
[]
[]
[]
[]
[]
[]
[]
[]
[]
[]
[]
[]
[]
[]
[]
[]
[]
[]
[]
[]
[]
[null,null,null,"Steyptur veggur "]
[null,null,null,null,null,null,"d","λ","R"]
[null,null,null,null,null,null,"m","W/mK"]
[null,null,null,"Ytra yfirborð"]
[]
[]
[]
[]
[]
[null,null,null,"Innra yfirborð"]
[null,null,null,"Alls (∑R)",null,null,null,null,{"$f":"SUM(I558:I564)","v":0}]
[null,null,null,"U=",null,null,null,null,{"$f":"1/I565","v":{"$error":"#DIV/0!"}}]
[null,null,null,"Rstaðall",null,null,null,null,{"$f":"1/'2. Orkurammi'!D6","v":2.5}]
[null,null,null,"………."]
[null,null,null,"Rnauðsyn",null,null,null,null,{"$f":"1/'2. Orkurammi'!D6-0","v":2.5}]
[null,null,null,"Samtals U",{"$f":"I566+0","v":{"$error":"#DIV/0!"}},{"$f":"IF(E570>0.4049,\"Ekki í lagi\",\"Í lagi\")","v":{"$error":"#DIV/0!"}}]
[]
[null,null,null,"Einangrunarþykkt",null,{"$f":"+G562*1000","v":0},"mm"]
[]
[]
[]
[]
[]
[]
[]
[]
[]
[]
[]
[]
[]
[]
[]
[]
[]
[]
[]
[]
[]
[]
[]
[]
[]
[]
[]
[]
[]
[]
[null,null,null,"Léttur veggur "]
[null,null,null,null,null,null,"d","λ","R"]
[null,null,null,null,null,null,"m","W/mK"]
[null,null,null,"Ytra yfirborð"]
[]
[]
[]
[]
[]
[]
[null,null,null,"Innri mótstaða"]
[null,null,null,"Alls (∑R)",null,null,null,null,{"$f":"SUM(I606:I613)","v":0}]
[null,null,null,"U=",null,null,null,null,{"$f":"1/I614","v":{"$error":"#DIV/0!"}}]
[null,null,null,"Rstaðall",null,null,null,null,{"$f":"1/'2. Orkurammi'!D7","v":3.3333333333333335}]
[null,null,null,"ΔU(Ef einangrað í heilu lagi)"]
[null,null,null,"……."]
[null,null,null,"Rnauðsyn",null,null,null,null,{"$f":"1/('2. Orkurammi'!D7-('3. Þykkt einangrunar'!I617))","v":3.3333333333333335}]
[null,null,null,"Samtals U",{"$f":"I615+I617","v":{"$error":"#DIV/0!"}},{"$f":"IF(E620>0.3049,\"Ekki í lagi\",\"Í lagi\")","v":{"$error":"#DIV/0!"}}]
[]
[null,null,null,"Einangrunarþykkt",null,{"$f":"G610*1000","v":0},"mm"]
[]
[]
[]
[]
[]
[]
[]
[]
[]
[]
[]
[]
[]
[]
[]
[]
[]
[]
[]
[]
[]
[]
[]
[]
[]
[]
[]
[]
[]
[]
[]
[]
[]
[]
[]
[]
[]
[]
[null,null,null,"Gólf "]
[null,null,null,null,null,null,"d","λ","R"]
[null,null,null,null,null,null,"m","W/mK"]
[null,null,null,"Ytra yfirborð"]
[]
[]
[]
[]
[]
[null,null,null,"Alls (∑R)",null,null,null,null,{"$f":"SUM(I664:I669)","v":0}]
[]
[null,null,null,"U=",null,null,null,null,{"$f":"1/I670","v":{"$error":"#DIV/0!"}}]
[null,null,null,"ΔU(Ef einangrað í heilu lagi)"]
[null,null,null,"Kólnunartala U",null,null,null,null,{"$f":"SUM(I672:I673)","v":{"$error":"#DIV/0!"}}]
[null,null,null,"Rstaðall=",null,null,null,null,{"$f":"1/'2. Orkurammi'!D8","v":3.3333333333333335}]
[null,null,null,"…….."]
[null,null,null,"Rnauðsyn=",null,null,null,null,{"$f":"1/('2. Orkurammi'!D8-(I673+I682+I683))","v":3.3333333333333335}]
[]
[null,null,null,"Einangrunarþykkt",null,{"$f":"+G668*1000","v":0},"mm"]
[]
[null,null,null,"Línukuldabrýr (ef einhverjar)","L (m)","ψ(W/mK)","L.itap W/K",null," ΔT=15"]
[null,null,null,"Kuldabrú útv."]
[null,null,null,"Kuldabrú innv"]
[null,null,null,"……….."]
[]
[null,null,null,"Samtals U",{"$f":"+I683+I682+I674","v":{"$error":"#DIV/0!"}},{"$f":"IF(E686>0.3049,\"Ekki í lagi\",\"Í lagi\")","v":{"$error":"#DIV/0!"}}]

{"sheet":"4. Hiti á efnisskilum","index":3,"n_rows":75,"n_cols":32,"rows_kept":75,"cut":false,"hidden":true,"merged":[[56,1,56,6],[56,26,56,31],[1,1,1,6],[1,26,1,31]]}
[]
[null,"Steyptur veggur einangraður að innan - Hitastig á efnisskilum",null,null,null,null,null,null,null,null,null,null,null,null,null,null,null,null,null,null,null,null,null,null,null,null,"Steyptur veggur einangraður að utan - Hitastig á efnisskilum"]
[null,null,"d","λ","R","ΔT","T",null,null,null,null,null,null,null,null,null,null,null,null,null,null,null,null,null,null,null,null,"d","λ","R","ΔT","T"]
[null,null,"m","W/mK",null,"°C","°C",null,null,null,null,null,null,null,null,null,null,null,null,null,null,null,null,null,null,null,null,"m","W/mK",null,"°C","°C"]
[null,"Hitastig úti",null,null,null,null,-15,null,null,null,null,null,null,null,null,null,null,null,null,null,null,null,null,null,null,null,"Hitastig úti",null,null,null,null,-15]
[]
[null,"Ytra yfirborð",null,null,{"$f":"'3. Þykkt einangrunar'!I9","v":0.04},{"$f":"E7/$E$22*(G$5-$G$21)","v":-0.56000000000000005},null,null,null,null,null,null,null,null,null,null,null,null,null,null,null,null,null,null,null,null,"Ytra yfirborð",null,null,{"$f":"'3. Þykkt einangrunar'!I48","v":0.13},{"$f":"AD7/$AD$20*($AF$5-$AF$19)","v":-1.1830000000000001}]
[null,null,null,null,null,null,{"$f":"G5-F7","v":-14.44},null,null,null,null,null,null,null,null,null,null,null,null,null,null,null,null,null,null,null,null,null,null,null,null,{"$f":"AF5-AE7","v":-13.817}]
[null,"Marmarasalli",{"$f":"'3. Þykkt einangrunar'!G10","v":1E-3},{"$f":"'3. Þykkt einangrunar'!H10","v":3},{"$f":"+C9/D9","v":3.3333333333333332E-4},{"$f":"E9/$E$22*(G$5-$G$21)","v":-4.6666666666666671E-3},null,null,null,null,null,null,null,null,null,null,null,null,null,null,null,null,null,null,null,null,"Klæðning",{"$f":"'3. Þykkt einangrunar'!G49","v":0.02},{"$f":"'3. Þykkt einangrunar'!H49","v":0.16},null,{"$f":"AD9/$AD$20*($AF$5-$AF$19)","v":0}]
[null,null,null,null,null,null,{"$f":"G8-F9","v":-14.435333333333332},null,null,null,null,null,null,null,null,null,null,null,null,null,null,null,null,null,null,null,null,null,null,null,null,{"$f":"AF8-AE9","v":-13.817}]
[null,"Múrhúð",{"$f":"'3. Þykkt einangrunar'!G11","v":0.02},{"$f":"'3. Þykkt einangrunar'!H11","v":1.4},{"$f":"+C11/D11","v":1.4285714285714287E-2},{"$f":"E11/$E$22*(G$5-$G$21)","v":-0.20000000000000004},null,null,null,null,null,null,null,null,null,null,null,null,null,null,null,null,null,null,null,null,"Loftræst bil (mikið)",{"$f":"'3. Þykkt einangrunar'!G50","v":0.02},null,null,0]
[null,null,null,null,null,null,{"$f":"G10-F11","v":-14.235333333333333},null,null,null,null,null,null,null,null,null,null,null,null,null,null,null,null,null,null,null,null,null,null,null,null,{"$f":"AF10-AE11","v":-13.817}]
[null,"Járnbent steinsteypa",{"$f":"'3. Þykkt einangrunar'!G12","v":0.18},{"$f":"'3. Þykkt einangrunar'!H12","v":1.95},{"$f":"+C13/D13","v":9.2307692307692313E-2},{"$f":"E13/$E$22*(G$5-$G$21)","v":-1.2923076923076924},null,null,null,null,null,null,null,null,null,null,null,null,null,null,null,null,null,null,null,null,"Steinull, veggplata",{"$f":"IF('3. Þykkt einangrunar'!E42=\"Nei\",'3. Þykkt einangrunar'!G51,'3. Þykkt einangrunar'!E43)","v":0.12228461538461539},{"$f":"'3. Þykkt einangrunar'!H51","v":3.5000000000000003E-2},{"$f":"AB13/AC13","v":3.4938461538461536},-31.794]
[null,null,null,null,null,null,{"$f":"G12-F13","v":-12.94302564102564},null,null,null,null,null,null,null,null,null,null,null,null,null,null,null,null,null,null,null,null,null,null,null,null,{"$f":"AF12-AE13","v":17.977}]
[null,"Frauðplast",{"$f":"IF('3. Þykkt einangrunar'!E3=\"Nei\",'3. Þykkt einangrunar'!G13,'3. Þykkt einangrunar'!E4)","v":8.588735714285714E-2},{"$f":"'3. Þykkt einangrunar'!H13","v":3.9E-2},{"$f":"+C15/D15","v":2.2022399267399266},{"$f":"E15/$E$22*(G$5-$G$21)","v":-30.831358974358974},null,null,null,null,null,null,null,null,null,null,null,null,null,null,null,null,null,null,null,null,"Járnbent steinsteypa",{"$f":"'3. Þykkt einangrunar'!G54","v":0.18},{"$f":"'3. Þykkt einangrunar'!H54","v":1.95},{"$f":"AB15/AC15","v":9.2307692307692313E-2},-0.84000000000000019]
[null,null,null,null,null,null,{"$f":"G14-F15","v":17.888333333333335},null,null,null,null,null,null,null,null,null,null,null,null,null,null,null,null,null,null,null,null,null,null,null,null,{"$f":"AF14-AE15","v":18.817}]
[null,"Múrhúð",{"$f":"'3. Þykkt einangrunar'!G14","v":2.5000000000000001E-2},{"$f":"'3. Þykkt einangrunar'!H14","v":1.2},{"$f":"+C17/D17","v":2.0833333333333336E-2},{"$f":"E17/$E$22*(G$5-$G$21)","v":-0.29166666666666674},null,null,null,null,null,null,null,null,null,null,null,null,null,null,null,null,null,null,null,null,"Innra yfirborð",null,null,{"$f":"'3. Þykkt einangrunar'!I55","v":0.13},-1.1830000000000001]
[null,null,null,null,null,null,{"$f":"G16-F17","v":18.180000000000003}]
[null,"Innra yfirborð",null,null,{"$f":"'3. Þykkt einangrunar'!I15","v":0.13},{"$f":"E19/$E$22*(G$5-$G$21)","v":-1.82},null,null,null,null,null,null,null,null,null,null,null,null,null,null,null,null,null,null,null,null,"Hitastig inni",null,null,null,null,20]
[null,null,null,null,null,null,null,null,null,null,null,null,null,null,null,null,null,null,null,null,null,null,null,null,null,null,null,null,null,{"$f":"SUM(AD5:AD18)","v":3.8461538461538458},{"$f":"SUM(AE5:AE19)","v":-35.000000000000007}]
[null,"Hitastig inni",null,null,null,null,20]
[null,null,null,null,{"$f":"SUM(E5:E21)","v":2.5},{"$f":"SUM(F5:F21)","v":-35}]
[]
[]
[]
[]
[]
[]
[]
[]
[]
[]
[]
[]
[]
[]
[]
[]
[]
[]
[]
[]
[]
[]
[]
[]
[]
[]
[]
[]
[]
[]
[]
[]
[]
[]
[null,"Steypt gólfpl. með gólfg. og grófm. (Einangrað í tveimur lögum) -  Hitastig á efnisskilum",null,null,null,null,null,null,null,null,null,null,null,null,null,null,null,null,null,null,null,null,null,null,null,null,"Steypt gólfpl. með gólfg. og grófm. (Einangrað í heilu lagi) - Hitastig á efnisskilum"]
[null,null,"d","λ","R","ΔT","T",null,null,null,null,null,null,null,null,null,null,null,null,null,null,null,null,null,null,null,null,"d","λ","R","ΔT","T"]
[null,null,"m","W/mK",null,"°C","°C",null,null,null,null,null,null,null,null,null,null,null,null,null,null,null,null,null,null,null,null,"m","W/mK",null,"°C","°C"]
[null,"Hitastig inni v/gólfgeisla",null,null,null,null,30,null,null,null,null,null,null,null,null,null,null,null,null,null,null,null,null,null,null,null,"Hitastig inni v/gólfgeisla",null,null,null,null,30]
[]
[null,"Innra yfirborð",null,null,null,null,null,null,null,null,null,null,null,null,null,null,null,null,null,null,null,null,null,null,null,null,"Innra yfirborð"]
[null,null,null,null,null,null,{"$f":"G60-F62","v":30},null,null,null,null,null,null,null,null,null,null,null,null,null,null,null,null,null,null,null,null,null,null,null,null,{"$f":"AF60-AE62","v":30}]
[null,"Gólfefni + Anhydrit ílögn m/gólflögnum",{"$f":"'3. Þykkt einangrunar'!G472","v":0.03},{"$f":"'3. Þykkt einangrunar'!H472","v":1.2},null,null,null,null,null,null,null,null,null,null,null,null,null,null,null,null,null,null,null,null,null,null,"Gólfefni +ílögn m/gólflögnum",{"$f":"'3. Þykkt einangrunar'!G417","v":3.5000000000000003E-2},{"$f":"'3. Þykkt einangrunar'!H417","v":1.2}]
[null,null,null,null,null,null,{"$f":"G63-F64","v":30},null,null,null,null,null,null,null,null,null,null,null,null,null,null,null,null,null,null,null,null,null,null,null,null,{"$f":"AF63-AE64","v":30}]
[null,"Frauðplasteinangrun",{"$f":"'3. Þykkt einangrunar'!G473","v":2.5000000000000001E-2},{"$f":"'3. Þykkt einangrunar'!H473","v":3.9E-2},{"$f":"C66/D66","v":0.64102564102564108},{"$f":"(E66/$E$75)*($G$60-$G$74)","v":4.8076923076923084},null,null,null,null,null,null,null,null,null,null,null,null,null,null,null,null,null,null,null,null,"Gólfplata",{"$f":"'3. Þykkt einangrunar'!G418","v":0.1},{"$f":"'3. Þykkt einangrunar'!H418","v":1.95},{"$f":"AB66/AC66","v":5.1282051282051287E-2},{"$f":"(AD66/$AD$73)*($AF$60-$AF$72)","v":0.37179487179487175}]
[null,null,null,null,null,null,{"$f":"G65-F66","v":25.192307692307693},null,null,null,null,null,null,null,null,null,null,null,null,null,null,null,null,null,null,null,null,null,null,null,null,{"$f":"AF65-AE66","v":29.628205128205128}]
[null,"Gólfplata",{"$f":"'3. Þykkt einangrunar'!G474","v":0.1},{"$f":"'3. Þykkt einangrunar'!H474","v":1.95},{"$f":"C68/D68","v":5.1282051282051287E-2},{"$f":"(E68/$E$75)*($G$60-$G$74)","v":0.38461538461538464},null,null,null,null,null,null,null,null,null,null,null,null,null,null,null,null,null,null,null,null,"Frauðplasteinangrun",{"$f":"IF('3. Þykkt einangrunar'!E410=\"Nei\",'3. Þykkt einangrunar'!G419,'3. Þykkt einangrunar'!E411)","v":7.3982758620689676E-2},{"$f":"'3. Þykkt einangrunar'!H419","v":3.9E-2},{"$f":"AB68/AC68","v":1.8969938107869149},{"$f":"(AD68/$AD$73)*($AF$60-$AF$72)","v":13.75320512820513}]
[null,null,null,null,null,null,{"$f":"G67-F68","v":24.80769230769231},null,null,null,null,null,null,null,null,null,null,null,null,null,null,null,null,null,null,null,null,null,null,null,null,{"$f":"AF67-AE68","v":15.874999999999998}]
[null,"Frauðplasteinangrun",{"$f":"IF('3. Þykkt einangrunar'!E465=\"Nei\",'3. Þykkt einangrunar'!G475,'3. Þykkt einangrunar'!E466)","v":4.4499999999999998E-2},{"$f":"'3. Þykkt einangrunar'!H475","v":3.9E-2},{"$f":"C70/D70","v":1.141025641025641},{"$f":"(E70/$E$75)*($G$60-$G$74)","v":8.5576923076923066},null,null,null,null,null,null,null,null,null,null,null,null,null,null,null,null,null,null,null,null,"Jarðvegur",null,null,{"$f":"'3. Þykkt einangrunar'!I420","v":1.5},10.874999999999998]
[null,null,null,null,null,null,{"$f":"G69-F70","v":16.250000000000004}]
[null,"Jarðvegur",null,null,1.5,{"$f":"(E72/$E$75)*($G$60-$G$74)","v":11.249999999999998},null,null,null,null,null,null,null,null,null,null,null,null,null,null,null,null,null,null,null,null,"Hitastig jörð",null,null,null,null,5]
[null,null,null,null,null,null,null,null,null,null,null,null,null,null,null,null,null,null,null,null,null,null,null,null,null,null,null,null,null,{"$f":"SUM(AD61:AD72)","v":3.4482758620689662},{"$f":"SUM(AE60:AE72)","v":25}]
[null,"Hitastig jörð",null,null,null,null,5]
[null,null,null,null,{"$f":"SUM(E60:E74)","v":3.3333333333333335},{"$f":"SUM(F60:F74)","v":25}]

{"sheet":"5. Gluggar&Hurðir","index":4,"n_rows":51,"n_cols":41,"rows_kept":51,"cut":false,"hidden":false,"merged":[[0,0,2,9],[13,32,13,36],[13,37,13,40],[13,2,13,4],[13,5,13,6],[13,7,13,9],[13,10,13,18],[13,19,13,26],[13,27,13,31]]}
["Gluggar og hurðir"]
[]
[]
[null,"Tafla 1"]
[null,"Inntaksstærðir","mm"]
[null,"Falsdýpt ",22]
[null,"Karmbreidd",62]
[null,"Póstabreidd",75]
[null,"Opnanlegt fag ",75]
[null,"Hurðarstykki hlið, ofan og milli ",120]
[null,"Hurðarstykki neðan ",200]
[]
[null,"Tafla 2"]
[null,"Gluggi / Hurð","Múrmál",null,null,"Karmlengd",null,"Póstalengd",null,null,"Fast gler (ljósmál)",null,null,null,null,null,null,null,null,"Opnanlegt fag / hurð",null,null,null,null,null,null,null,"Gler",null,null,null,null,"Spjöld",null,null,null,null,"Samtals"]
[null,null,"b [mm]","h [mm]","A [m2]","Lk [mm]","ψ (W/mK)","Lp [mm]","ψ (W/mK)","(A*U)k  [W/K]","b1 [mm]","h1 [mm]","b2 [mm]","h2 [mm]","b3 [mm]","h3 [mm]","Ag [m2]","Ug [W/m2K)","(A*U)g [W/K]","Fjöldi","bf [mm]","hf [mm]","Ummál [mm]","Afag [m2]","Ufag [W/m2K]","ψfag [W/mK]","(A*U)fag","bog [mm]","hog [mm]","Aog [m2]","Uog [W/m2K]","(A*U)og [W/K]","bs [mm]","hs [mm]","As [m2]","Us [W/m2K]","(A*U)s [W/K]","Agler [m2]","A*U [W/K]","Uvegið [W/m2K]","Glerhlutfall"]
["Gluggar"]
["G1","Stofa",2900,1800,{"$f":"(C17/1000)*(D17/1000)","v":5.22},{"$f":"2*((C17-$C$7)+(D17-$C$7))","v":9152},0.26,{"$f":"2*(D17-2*$C$7)+2*(560-$C$7-0.5*$C$8)","v":4273},{"$f":"2*0.089","v":0.17799999999999999},{"$f":"(F17/1000)*G17+(H17/1000)*I17","v":3.1401139999999996},{"$f":"560-$C$7-0.5*$C$8","v":460.5},{"$f":"415-$C$7-0.5*$C$8","v":315.5},{"$f":"C17-2*(560+0.5*$C$8)","v":1705},{"$f":"D17-2*$C$7","v":1676},{"$f":"K17","v":460.5},{"$f":"L17","v":315.5},{"$f":"((K17*L17+M17*N17+O17*P17)/(1000000))","v":3.1481555000000001},{"$f":"IF('2. Orkurammi'!$H$22=\"Annað\",'2. Orkurammi'!$J$22,'2. Orkurammi'!$I$22)","v":1.1000000000000001},{"$f":"Q17*R17","v":3.4629710500000006},2,{"$f":"560-($C$7-$C$6)-(0.5*$C$8-$C$6)","v":504.5},{"$f":"(D17-415-($C$7-$C$6)-(0.5*$C$8-$C$6))","v":1329.5},{"$f":"2*(U17-$C$9+V17-$C$9)","v":3368},{"$f":"((T17*U17*V17)/(1000000))","v":1.3414655},null,null,{"$f":"(W17/1000)*Z17+X17*Y17","v":0},{"$f":"U17-2*$C$9","v":354.5},{"$f":"V17-2*$C$9","v":1179.5},{"$f":"T17*(AB17*AC17)/1000000","v":0.83626549999999999},{"$f":"IF('2. Orkurammi'!$H$24=\"Annað\",'2. Orkurammi'!$J$24,'2. Orkurammi'!$I$24)","v":1.9},{"$f":"AD17*AE17","v":1.58890445},null,null,null,null,{"$f":"AI17*AJ17","v":0},{"$f":"Q17+AD17","v":3.9844210000000002},{"$f":"J17+S17+AA17+AF17+AK17","v":8.1919895},{"$f":"AM17/E17","v":1.5693466475095785},{"$f":"AL17/E17","v":0.76329904214559396}]
["G2,G3","Stofa",2000,1800,3.6,7352,0.26,{"$f":"(D18-2*$C$7)+(560-$C$7-0.5*$C$8)","v":2136.5},{"$f":"2*0.089","v":0.17799999999999999},{"$f":"(F18/1000)*G18+(H18/1000)*I18","v":2.291817},{"$f":"560-$C$7-0.5*$C$8","v":460.5},{"$f":"415-$C$7-0.5*$C$8","v":315.5},{"$f":"C18-(560+0.5*$C$8)","v":1402.5},{"$f":"D18-2*$C$7","v":1676},null,null,{"$f":"((K18*L18+M18*N18+O18*P18)/(1000000))","v":2.49587775},{"$f":"IF('2. Orkurammi'!$H$22=\"Annað\",'2. Orkurammi'!$J$22,'2. Orkurammi'!$I$22)","v":1.1000000000000001},{"$f":"Q18*R18","v":2.7454655250000002},1,{"$f":"560-($C$7-$C$6)-(0.5*$C$8-$C$6)","v":504.5},{"$f":"(D18-415-($C$7-$C$6)-(0.5*$C$8-$C$6))","v":1329.5},3368,0.67073274999999999,null,null,{"$f":"(W18/1000)*Z18+X18*Y18","v":0},{"$f":"U18-2*$C$9","v":354.5},{"$f":"V18-2*$C$9","v":1179.5},{"$f":"T18*(AB18*AC18)/1000000","v":0.41813275},{"$f":"IF('2. Orkurammi'!$H$24=\"Annað\",'2. Orkurammi'!$J$24,'2. Orkurammi'!$I$24)","v":1.9},{"$f":"AD18*AE18","v":0.79445222500000001},null,null,null,null,{"$f":"AI18*AJ18","v":0},{"$f":"Q18+AD18","v":2.9140104999999998},{"$f":"J18+S18+AA18+AF18+AK18","v":5.8317347499999999},{"$f":"AM18/E18","v":1.6199263194444444},{"$f":"AL18/E18","v":0.80944736111111104}]
["G4","Eldhús",900,1200,1.08,3952,0.26,0,{"$f":"2*0.089","v":0.17799999999999999},1.02752,null,null,null,null,null,null,null,{"$f":"IF('2. Orkurammi'!$H$22=\"Annað\",'2. Orkurammi'!$J$22,'2. Orkurammi'!$I$22)","v":1.1000000000000001},{"$f":"Q19*R19","v":0},1,{"$f":"C19-2*($C$7-$C$6)","v":820},{"$f":"D19-2*($C$7-$C$6)","v":1120},3580,0.91839999999999999,null,null,0,{"$f":"U19-2*$C$9","v":670},{"$f":"V19-2*$C$9","v":970},{"$f":"T19*(AB19*AC19)/1000000","v":0.64990000000000003},{"$f":"IF('2. Orkurammi'!$H$24=\"Annað\",'2. Orkurammi'!$J$24,'2. Orkurammi'!$I$24)","v":1.9},{"$f":"AD19*AE19","v":1.23481},null,null,null,null,0,{"$f":"Q19+AD19","v":0.64990000000000003},2.26233,{"$f":"AM19/E19","v":2.0947499999999999},{"$f":"AL19/E19","v":0.60175925925925922}]
["G5","Svefnherbergi",1900,1200,2.2799999999999998,5952,0.26,{"$f":"D20-2*$C$7","v":1076},{"$f":"2*0.089","v":0.17799999999999999},1.7390479999999999,{"$f":"C20-(585+0.5*$C$9)","v":1277.5},{"$f":"D20-2*$C$7","v":1076},null,null,null,null,{"$f":"((K20*L20+M20*N20+O20*P20)/(1000000))","v":1.37459},{"$f":"IF('2. Orkurammi'!$H$22=\"Annað\",'2. Orkurammi'!$J$22,'2. Orkurammi'!$I$22)","v":1.1000000000000001},{"$f":"Q20*R20","v":1.5120490000000002},1,{"$f":"585-($C$7-$C$6)-(0.5*$C$8-$C$6)","v":529.5},{"$f":"D20-2*($C$7-$C$6)","v":1120},2999,0.59304000000000001,null,null,0,379.5,970,0.36811500000000003,{"$f":"IF('2. Orkurammi'!$H$24=\"Annað\",'2. Orkurammi'!$J$24,'2. Orkurammi'!$I$24)","v":1.9},0.69941850000000005,null,null,null,null,0,1.7427049999999999,3.9505155000000003,1.7326822368421055,0.76434429824561412]
["G6,G7","Svefnherbergi",1250,1200,1.5,4652,0.26,{"$f":"D21-2*$C$7","v":1076},0.17799999999999999,1.4010480000000001,{"$f":"C21-(585+0.5*$C$9)","v":627.5},{"$f":"D21-2*$C$7","v":1076},null,null,null,null,0.67518999999999996,{"$f":"IF('2. Orkurammi'!$H$22=\"Annað\",'2. Orkurammi'!$J$22,'2. Orkurammi'!$I$22)","v":1.1000000000000001},{"$f":"Q21*R21","v":0.74270900000000006},1,{"$f":"585-($C$7-$C$6)-(0.5*$C$8-$C$6)","v":529.5},{"$f":"D21-2*($C$7-$C$6)","v":1120},2999,0.59304000000000001,null,null,null,{"$f":"U21-2*$C$9","v":379.5},{"$f":"V21-2*$C$9","v":970},{"$f":"T21*(AB21*AC21)/1000000","v":0.36811500000000003},{"$f":"IF('2. Orkurammi'!$H$24=\"Annað\",'2. Orkurammi'!$J$24,'2. Orkurammi'!$I$24)","v":1.9},0.69941850000000005,null,null,null,null,null,1.0433049999999999,2.8431755000000001,1.8954503333333335,0.69553666666666658]
["G8","Baðherbergi",700,700,0.48999999999999994,2552,0.26,0,0.17799999999999999,0.66352,null,null,null,null,null,null,null,{"$f":"IF('2. Orkurammi'!$H$22=\"Annað\",'2. Orkurammi'!$J$22,'2. Orkurammi'!$I$22)","v":1.1000000000000001},null,1,{"$f":"C22-2*($C$7-$C$6)","v":620},{"$f":"D22-2*($C$7-$C$6)","v":620},2180,0.38440000000000002,null,null,0,470,470,0.22090000000000001,{"$f":"IF('2. Orkurammi'!$H$24=\"Annað\",'2. Orkurammi'!$J$24,'2. Orkurammi'!$I$24)","v":1.9},0.41971000000000003,null,null,null,null,0,0.22090000000000001,1.0832299999999999,2.2106734693877552,0.45081632653061232]
["G9","….",null,null,null,null,0.26,null,0.17799999999999999,0,null,null,null,null,null,null,null,{"$f":"IF('2. Orkurammi'!$H$22=\"Annað\",'2. Orkurammi'!$J$22,'2. Orkurammi'!$I$22)","v":1.1000000000000001},null,null,null,null,null,null,null,null,0,null,null,null,{"$f":"IF('2. Orkurammi'!$H$24=\"Annað\",'2. Orkurammi'!$J$24,'2. Orkurammi'!$I$24)","v":1.9},0,null,null,null,null,0]
["G10","….",null,null,null,null,0.26,null,0.17799999999999999,0,null,null,null,null,null,null,null,{"$f":"IF('2. Orkurammi'!$H$22=\"Annað\",'2. Orkurammi'!$J$22,'2. Orkurammi'!$I$22)","v":1.1000000000000001},null,null,null,null,null,null,null,null,0,null,null,null,{"$f":"IF('2. Orkurammi'!$H$24=\"Annað\",'2. Orkurammi'!$J$24,'2. Orkurammi'!$I$24)","v":1.9},0,null,null,null,null,0]
["Hurðir"]
["H1","Svefnherbergi ",null,null,null,null,0.26,null,null,0,null,null,null,null,null,null,null,null,null,1,null,null,null,null,null,null,0,null,null,null,null,0,null,null,{"$f":"T26*(AG26*AH26)/1000000","v":0},null,0,{"$f":"Q26+AD26","v":0},{"$f":"J26+S26+AA26+AF26+AK26","v":0}]
["H2","Svefnherbergi",null,null,null,null,0.26,null,null,0,null,null,null,null,null,null,null,null,null,1,null,null,null,null,null,null,0,null,null,null,null,0,null,null,{"$f":"T27*(AG27*AH27)/1000000","v":0},null,0,0,{"$f":"J27+S27+AA27+AF27+AK27","v":0}]
["H3","Baðherbergi",null,null,null,null,0.26,null,null,0,null,null,null,null,null,null,null,null,null,1,null,null,null,null,null,null,0,null,null,null,null,0,null,null,0,null,0,0,0]
["H4","Svalahurð",900,2050,{"$f":"(C29/1000)*(D29/1000)","v":1.845},{"$f":"2*((C29-$C$7)+(D29-$C$7))","v":5652},0.26,null,null,1.4695200000000002,null,null,null,null,null,null,null,null,null,1,{"$f":"C29-2*($C$7-$C$6)","v":820},{"$f":"D29-2*($C$7-$C$6)","v":1970},{"$f":"2*(U29-$C$10+V29-$C$11)","v":4940},{"$f":"((T29*U29*V29)/(1000000))","v":1.6153999999999999},null,null,0,{"$f":"U29-2*$C$10","v":580},{"$f":"V29-$C$10-$C$11","v":1650},{"$f":"T29*(AB29*AC29)/1000000","v":0.95699999999999996},{"$f":"IF('2. Orkurammi'!$H$24=\"Annað\",'2. Orkurammi'!$J$24,'2. Orkurammi'!$I$24)","v":1.9},1.8182999999999998,null,null,0,null,0,0.95699999999999996,3.28782,{"$f":"AM29/E29","v":1.7820162601626017},{"$f":"AL29/E29","v":0.5186991869918699}]
["H5","Aðalhurð",1030,2150,{"$f":"(C30/1000)*(D30/1000)","v":2.2145000000000001},{"$f":"2*((C30-$C$7)+(D30-$C$7))","v":6112},0.26,0,null,1.5891200000000001,null,null,null,null,null,null,null,null,null,1,{"$f":"C30-2*($C$7-$C$6)","v":950},{"$f":"D30-2*($C$7-$C$6)","v":2070},{"$f":"2*(U30-$C$10+V30-$C$11)","v":5400},{"$f":"((T30*U30*V30)/(1000000))","v":1.9664999999999999},null,null,0,{"$f":"U30-2*$C$10","v":710},1390,0.9869,{"$f":"IF('2. Orkurammi'!$H$24=\"Annað\",'2. Orkurammi'!$J$24,'2. Orkurammi'!$I$24)","v":1.9},1.8751099999999998,null,null,0,null,0,0.9869,3.4642299999999997,1.564339580040641,0.44565364642131405]
["H6","….",null,null,null,null,0.26,null,null,0,null,null,null,null,null,null,null,null,null,1,null,null,null,null,null,null,0,null,null,null,null,0,null,null,0,null,0,0,0]
["H7","….",null,null,null,null,0.26,null,null,0,null,null,null,null,null,null,null,null,null,1,null,null,null,null,null,null,0,null,null,null,null,0,null,null,0,null,0,0,0]
[]
[null,"Tafla 3"]
[null,"Vegið meðaltal glugga og hurða"]
[null,"Gluggi","Fjöldi","Múrmál [m2]","Glerflm [m2]","∑A*U","∑U"]
[null,{"$f":"A17","v":"G1"},1,{"$f":"C37*E17","v":5.22},{"$f":"C37*AL17","v":3.9844210000000002},{"$f":"C37*AM17","v":8.1919895},{"$f":"C37*AN17","v":1.5693466475095785}]
[null,{"$f":"A18","v":"G2,G3"},2,7.2,5.8280209999999997,{"$f":"C38*AM18","v":11.6634695},3.2398526388888889]
[null,{"$f":"A19","v":"G4"},1,1.08,0.64990000000000003,2.26233,2.0947499999999999]
[null,{"$f":"A20","v":"G5"},1,2.2799999999999998,1.7427049999999999,3.9505155000000003,1.7326822368421055]
[null,"G6,G7",2,3,2.0866099999999999,5.6863510000000002,3.7909006666666669]
[null,"G8",1,0.48999999999999994,0.22090000000000001,1.0832299999999999,2.2106734693877552]
[null,null,{"$f":"SUM(C37:C42)","v":8},{"$f":"SUM(D37:D42)","v":19.27},null,"Uvegið",{"$f":"SUM(F37:F42)/D43","v":1.7040936948624805}]
[]
[null,"Hurð","Fjöldi","Múrmál [m2]","Glerflm [m2]","∑A*U","∑U"]
[null,"H1",0,{"$f":"C46*E26","v":0},{"$f":"C46*AL26","v":0},{"$f":"C46*AM26","v":0},{"$f":"C46*AN26","v":0}]
[null,"H2",0,{"$f":"C47*E27","v":0},{"$f":"C47*AL27","v":0},{"$f":"C47*AM27","v":0},{"$f":"C47*AN27","v":0}]
[null,"H3",0,{"$f":"C48*E28","v":0},{"$f":"C48*AL28","v":0},{"$f":"C48*AM28","v":0},{"$f":"C48*AN28","v":0}]
[null,"H4",1,{"$f":"C49*E29","v":1.845},{"$f":"C49*AL29","v":0.95699999999999996},{"$f":"C49*AM29","v":3.28782},{"$f":"IF('2. Orkurammi'!$H$36=\"Annað\",'2. Orkurammi'!$J$36,'2. Orkurammi'!$I$36)","v":1.7820162601626017}]
[null,"H5",1,{"$f":"C50*E30","v":2.2145000000000001},{"$f":"C50*AL30","v":0.9869},{"$f":"C50*AM30","v":3.4642299999999997},{"$f":"IF('2. Orkurammi'!$H$34=\"Annað\",'2. Orkurammi'!$J$34,'2. Orkurammi'!$I$34)","v":1.564339580040641}]
[null,null,{"$f":"SUM(C46:C50)","v":2},{"$f":"SUM(D46:D50)","v":4.0594999999999999},null,"Uvegið",{"$f":"((G49*D49+G50*D50)/(D49+D50))","v":1.6632713388348319}]

{"sheet":"6. Orkubúskapur","index":5,"n_rows":42,"n_cols":13,"rows_kept":42,"cut":false,"hidden":false,"merged":[[1,8,1,12],[0,0,0,5],[11,7,11,12]]}
["Mat á afl- og varmaþörf byggingar",null,null,null,null,null,null,"Veljið stað á landinu",null,null,null,null,"Tafla 4 Varmaþörf á mánaðargrundvelli"]
[null,null,null,null,null,null,null,"Reykjavík","Áætluð varmaþörf (gögn frá 2012)"]
["Tafla 1  Heildarvarmaleiðnitap",null,null,null,null,null,null,"Ársmeðalhiti",{"$f":"'10. Veðurgögn'!B32","v":5.6},"°C"]
["Byggingarhluti","U [W/m2K]","A         [m2]","U*A     [W/K]","Δt              [K]","Ф          [W]",null,"Mánuður","Gráðutímar","Varmaþörf [kWh/mán]","Mánuður","Gráðutímar","Varmaþörf [kWh/mán]"]
["Þak",{"$f":"'2. Orkurammi'!D16","v":0.20000000000000007},{"$f":"'2. Orkurammi'!C16","v":200},{"$f":"B5*C5","v":40.000000000000014},35,{"$f":"D5*E5","v":1400.0000000000005},null,"Janúar",{"$f":"'10. Veðurgögn'!B18","v":14554.600000000006},{"$f":"I5*($B$24+$B$34)*0.001","v":4837.4030408980998},"Júlí",{"$f":"'10. Veðurgögn'!H18","v":5644.0000000000055},{"$f":"L5*($B$24+$B$34)*0.001","v":1875.8538718225777}]
["Steyptir veggir",{"$f":"'2. Orkurammi'!D17","v":0.4},{"$f":"'2. Orkurammi'!C17","v":150},{"$f":"B6*C6","v":60},35,{"$f":"D6*E6","v":2100},null,"Febrúar",{"$f":"'10. Veðurgögn'!C18","v":12138.799999999992},4034.4817468603596,"Ágúst",{"$f":"'10. Veðurgögn'!I18","v":5691.4000000000015},1891.6078536660189]
["Léttir veggir",{"$f":"'2. Orkurammi'!D18","v":0.3},{"$f":"'2. Orkurammi'!C18","v":0},0,35,0,null,"Mars",{"$f":"'10. Veðurgögn'!D18","v":12618.200000000006},4193.816322719993,"September",{"$f":"'10. Veðurgögn'!J18","v":9099.1999999999935},3024.2327339631411]
["Gólf",{"$f":"'2. Orkurammi'!D19","v":0.3},{"$f":"'2. Orkurammi'!C19","v":200},{"$f":"'2. Orkurammi'!E19","v":25.714285714285712},35,899.99999999999989,null,"Apríl",{"$f":"'10. Veðurgögn'!E18","v":11278},3748.3841187836661,"Október",{"$f":"'10. Veðurgögn'!K18","v":11550.800000000005},3839.0526050049998]
["Gluggar",{"$f":"'2. Orkurammi'!D20","v":1.7040936948624805},{"$f":"'2. Orkurammi'!C20","v":18},30.67368650752465,35,1073.5790277633628,null,"Maí",{"$f":"'10. Veðurgögn'!F18","v":10167.100000000006},3379.1626329212122,"Nóvember",{"$f":"'10. Veðurgögn'!L18","v":13304.500000000007},4421.9166969637618]
["Hurðir",{"$f":"'2. Orkurammi'!D21","v":1.6632713388348319},{"$f":"'2. Orkurammi'!C21","v":4},6.6530853553393277,35,232.85798743687647,null,"Júní",{"$f":"'10. Veðurgögn'!G18","v":6702.5999999999995},2227.6927996594609,"Desember",{"$f":"'10. Veðurgögn'!M18","v":13861.799999999997},4607.1423104943615]
["Heild byggingarhluta",null,null,{"$f":"SUM(D5:D10)","v":163.0410575771497},null,{"$f":"SUM(F5:F10)","v":5706.4370152002384},null,"Heild",{"$f":"SUM(I5:I10)+SUM(L5:L10)","v":126611.00000000003},"°Ch/ár",null,{"$f":"SUM(J5:J10)+SUM(M5:M10)","v":42080.746733757653},"kWh/ár"]
["Kuldabrýr","ψ     [W/mK]","l            [m]","ψ·L (W/K)","Δt              [K]","Ф          [W]"]
["Lóðréttar kuldabrýr við úthorn",{"$f":"'2. Orkurammi'!D27","v":0.04},{"$f":"'2. Orkurammi'!C27","v":12},{"$f":"B13*C13","v":0.48},35,{"$f":"D13*E13","v":16.8}]
["Láréttar kuldabrýr við plötuskil",{"$f":"'2. Orkurammi'!D28","v":0.83},{"$f":"'2. Orkurammi'!C28","v":0},{"$f":"B14*C14","v":0},35,{"$f":"D14*E14","v":0}]
["Lóðréttar kuldabrýr við útvegg/innvegg",{"$f":"'2. Orkurammi'!D29","v":0.83},{"$f":"'2. Orkurammi'!C29","v":9},7.47,35,261.45]
["Kuldabrýr við svalir",{"$f":"'2. Orkurammi'!D30","v":0.83},{"$f":"'2. Orkurammi'!C30","v":0},0,35,0]
["Kuldabrýr útistigi-útveggur",{"$f":"'2. Orkurammi'!D31","v":0.6},{"$f":"'2. Orkurammi'!C31","v":0},0,35,0]
["Kuldabrýr við glugga",{"$f":"'2. Orkurammi'!D32","v":0.04},{"$f":"'2. Orkurammi'!C32","v":20},0.8,35,28]
["Kuldabrýr við hurðir",{"$f":"'2. Orkurammi'!D33","v":0.04},{"$f":"'2. Orkurammi'!C33","v":10},0.4,35,14]
["Sökkull undir útvegg",{"$f":"'2. Orkurammi'!D34","v":0.48},{"$f":"'2. Orkurammi'!C34","v":60},{"$f":"'2. Orkurammi'!E34","v":12.342857142857142},35,431.99999999999994]
["Sökkull undir innvegg",{"$f":"'2. Orkurammi'!D35","v":0.46},{"$f":"'2. Orkurammi'!C35","v":20},{"$f":"'2. Orkurammi'!E35","v":11.828571428571431},35,414.00000000000006]
["Aðrar",{"$f":"'2. Orkurammi'!D36","v":0},{"$f":"'2. Orkurammi'!C36","v":0},0,35,0]
[null,null,null,{"$f":"SUM(D13:D22)","v":33.321428571428569},null,{"$f":"SUM(F13:F22)","v":1166.25}]
["Heild",{"$f":"D11+D23","v":196.36248614857828},"W/K"]
[null,{"$f":"F11+F23","v":6872.6870152002384},"W"]
[]
[]
["Tafla2 Loftskiptatap"]
["Loftskiptatap rýmis",null,"Eining"]
["Gólfflatarmál",{"$f":"+'2. Orkurammi'!N17","v":200},"m2"]
["Lofthæð",2.5,"m"]
["Rúmmál hitaðs rýmis (VR)",{"$f":"B30*B31","v":500},"m3"]
["Fjöldi loftskipta (n)",0.8,"h-1"]
["Varmaflutningsstuðull loftskipta (Hv)",{"$f":"0.34*B32*B33","v":136},"W/K"]
[]
["Tafla 3 Afl- og varmaþörf"]
["Afl- og varmaþörf byggingar",null,"Eining"]
["Hitastig inni",20,"°C"]
["Viðmiðunarútihiti",-15,"°C"]
["Reiknuð aflþörf (ФTOTAL)",{"$f":"(B38-(B39))*(B24+B34)","v":11632.687015200239},"W"]
["Gráðutímafjöldi",{"$f":"'10. Veðurgögn'!N18","v":126611.00000000001},"°Ch/ár"]
["Reiknuð varmaþörf á ársgrundvelli",{"$f":"B41*(B24+B34)*0.001","v":42080.746733757653},"kWh/ár"]

{"sheet":"7. Raki_rakamagn","index":6,"n_rows":174,"n_cols":14,"rows_kept":174,"cut":false,"hidden":true,"merged":[[13,1,13,6],[48,1,48,6],[109,1,109,6],[144,1,144,6]]}
[]
[]
[null,"Reikningar miðast við eftirfarandi umhverfisaðstæður"]
[null,null,"Lofthiti (°C)","Loftraki (%HR)"]
[null,"Vetur"]
[null,"Inni",22,40]
[null,"Úti",-2,80]
[null,"Sumar"]
[null,"Inni",22,55]
[null,"Úti",10,80]
[]
[]
[null,"VETUR"]
[null,"Steyptur veggur einangraður að innan - Hitastig á efnisskilum"]
[null,null,"d","λ","R","ΔT","T",null,null,"Z",null,null,"HR"]
[null,null,"m","W/mK",null,"°C","°C",null,null,"s/m",null,null,"%"]
[null,"Hitastig úti",null,null,null,null,{"$f":"C7","v":-2},4.13,null,null,null,{"$f":"D7*H17/100","v":3.3039999999999998},{"$f":"(L17/H17)*100","v":80},{"$f":"IF(M17>100,\"Döggvun\",\"OK\")","v":"OK"}]
[]
[null,"Ytra yfirborð",null,null,{"$f":"'3. Þykkt einangrunar'!I9","v":0.04},{"$f":"(E19/$E$36)*($G$17-$G$35)","v":-0.38400000000000001}]
[null,"……………………………..skil",null,null,null,null,{"$f":"G17-F19","v":-1.6160000000000001},{"$f":"-0.0039*G20^3-0.0055*G20^2+0.3577*G20+4.8343","v":4.2583522322944001},null,null,null,{"$f":"L17","v":3.3039999999999998},{"$f":"(L20/H20)*100","v":77.588696748549722},{"$f":"IF(M20>100,\"Döggvun\",\"OK\")","v":"OK"}]
[null,"Marmarasalli",{"$f":"'3. Þykkt einangrunar'!G10","v":1E-3},{"$f":"'3. Þykkt einangrunar'!H10","v":3},{"$f":"C21/D21","v":3.3333333333333332E-4},{"$f":"(E21/$E$36)*($G$17-$G$35)","v":-3.2000000000000002E-3},null,null,8.9999999999999996E-7,{"$f":"C21/I21","v":1111.1111111111111},{"$f":"($L$35-$L$17)*J21/$J$36","v":1.5961666314933981E-2}]
[null,"……………………………..skil",null,null,null,null,{"$f":"G20-F21","v":-1.6128},{"$f":"-0.0039*G22^3-0.0055*G22^2+0.3577*G22+4.8343","v":4.2594561197436924},null,null,null,{"$f":"L20+K21","v":3.3199616663149336},77.943323583638843,"OK"]
[null,"Múrhúð",{"$f":"'3. Þykkt einangrunar'!G11","v":0.02},{"$f":"'3. Þykkt einangrunar'!H11","v":1.4},{"$f":"C23/D23","v":1.4285714285714287E-2},-0.13714285714285718,null,null,1.5E-6,{"$f":"C23/I23","v":13333.333333333334},{"$f":"($L$35-$L$17)*J23/$J$36","v":0.19153999577920777}]
[null,"……………………………..skil",null,null,null,null,{"$f":"G22-F23","v":-1.4756571428571428},4.3070128556962839,null,null,null,{"$f":"L22+K23","v":3.5115016620941413},81.529862569366813,"OK"]
[null,"Járnbent steinsteypa",{"$f":"'3. Þykkt einangrunar'!G12","v":0.18},{"$f":"'3. Þykkt einangrunar'!H12","v":1.95},9.2307692307692313E-2,-0.88615384615384629,null,null,1.1999999999999999E-6,150000,2.1548249525160874]
[null,"……………………………..skil",null,null,null,null,{"$f":"G24-F25","v":-0.58950329670329649},4.6223222998610023,null,null,null,{"$f":"L24+K25","v":5.6663266146102291},122.58614278759015,"Döggvun"]
[null,"Frauðplast",{"$f":"'3. Þykkt einangrunar'!G13","v":8.588735714285714E-2},{"$f":"'3. Þykkt einangrunar'!H13","v":3.9E-2},2.2022399267399266,-21.141503296703299,null,null,2.5000000000000002E-6,34354.942857142851,0.493525920738905]
[null,"……………………………..skil",null,null,null,null,{"$f":"G26-F27","v":20.552000000000003},{"$f":"0.0004*G28^3+0.0026*G28^2+0.4443*G28+4.2647","v":17.966494005043202},null,null,null,{"$f":"L26+K27","v":6.1598525353491338},34.285223002440326,"OK"]
[null,"Múrhúð",{"$f":"'3. Þykkt einangrunar'!G14","v":2.5000000000000001E-2},{"$f":"'3. Þykkt einangrunar'!H14","v":1.2},2.0833333333333336E-2,-0.20000000000000004,null,null,1.5E-6,16666.666666666668,0.23942499472400974]
[null,"……………………………..skil",null,null,null,null,{"$f":"G28-F29","v":20.752000000000002},{"$f":"0.0004*G30^3+0.0026*G30^2+0.4443*G30+4.2647","v":18.179194110003202},null,null,null,{"$f":"L28+K29","v":6.3992775300731433},35.20110677817069,"OK"]
[null,"Málning (Alkyd)",1.05E-4,null,null,0,null,null,null,95000,1.3647224699268552]
[null,"……………………………..skil",null,null,null,null,{"$f":"G30-F31","v":20.752000000000002},{"$f":"0.0004*G32^3+0.0026*G32^2+0.4443*G32+4.2647","v":18.179194110003202},null,null,null,{"$f":"L30+K31","v":7.7639999999999985},42.708163810890902,"OK"]
[null,"Innra yfirborð",null,null,{"$f":"'3. Þykkt einangrunar'!I15","v":0.13},-1.2480000000000002]
[]
[null,"Hitastig inni",null,null,null,null,{"$f":"C6","v":22},19.41,null,null,null,{"$f":"D6*H35/100","v":7.7639999999999993},{"$f":"(L35/H35)*100","v":40},"OK"]
[null,null,null,null,{"$f":"SUM(E17:E35)","v":2.5},{"$f":"SUM(F17:F35)","v":-24.000000000000004},null,null,null,{"$f":"SUM(J21:J31)","v":310466.05396825395},{"$f":"SUM(K17:K35)","v":4.4599999999999991}]
[null,"Mat á rakaflutningi"]
[null,"Rakaflutningur inn (ginn)",{"$f":"((L35-H26)/(J31+J29+J27))*0.001","v":2.1515155944276397E-8},"kg/m2s"]
[null,"Rakaflutningur út (gút)",{"$f":"((H26-L17)/(J21+J23+J25))*0.001","v":8.0168247964520423E-9},"kg/m2s"]
[null,"Uppsafnað (guppsafnað)",{"$f":"C38-C39","v":1.3498331147824355E-8},"kg/m2s"]
[null,"Sekúndur per mánuð",{"$f":"60*60*24*30","v":2592000},"s/mán"]
[null,"Raki per mánuð (vetur)",{"$f":"C40*C41","v":3.4987674335160729E-2},"kg/m2mán"]
[null,"Raki per mánuð (vetur)",{"$f":"C42*1000","v":34.987674335160726},"g/m2mán"]
[]
[]
[]
[]
[null,"SUMAR"]
[null,"Steyptur veggur einangraður að innan - Hitastig á efnisskilum"]
[null,null,"d","λ","R","ΔT","T",null,null,"Z",null,null,"HR"]
[null,null,"m","W/mK",null,"°C","°C",null,null,"s/m",null,null,"%"]
[null,"Hitastig úti",null,null,null,null,{"$f":"C10","v":10},9.4,null,null,null,{"$f":"D10*H52/100","v":7.52},{"$f":"(L52/H52)*100","v":80},{"$f":"IF(M52>100,\"Döggvun\",\"OK\")","v":"OK"}]
[]
[null,"Ytra yfirborð",null,null,{"$f":"'3. Þykkt einangrunar'!I9","v":0.04},{"$f":"(E54/$E$71)*($G$52-$G$70)","v":-0.192}]
[null,"……………………………..skil",null,null,null,null,{"$f":"G52-F54","v":10.192},{"$f":"0.000003*G55^4+0.0001*G55^3+0.0102*G55^2+0.3387*G55+4.8184","v":9.4682169212122229},null,null,null,{"$f":"L52","v":7.52},{"$f":"(L55/H55)*100","v":79.423613364333519},{"$f":"IF(M55>100,\"Döggvun\",\"OK\")","v":"OK"}]
[null,"Marmarasalli",{"$f":"'3. Þykkt einangrunar'!G10","v":1E-3},{"$f":"'3. Þykkt einangrunar'!H10","v":3},{"$f":"C56/D56","v":3.3333333333333332E-4},{"$f":"(E56/$E$71)*($G$52-$G$70)","v":-1.6000000000000001E-3},null,null,8.9999999999999996E-7,{"$f":"C56/I56","v":1111.1111111111111},{"$f":"($L$70-$L$52)*(J56/$J$71)","v":1.4580482580605677E-2}]
[null,"……………………………..skil",null,null,null,null,{"$f":"G55-F56","v":10.1936},{"$f":"0.000003*G57^4+0.0001*G57^3+0.0102*G57^2+0.3387*G57+4.8184","v":9.4691617350035138},null,null,null,{"$f":"L55+K56","v":7.5345804825806049},79.569667235996462,{"$f":"IF(M57>100,\"Döggvun\",\"OK\")","v":"OK"}]
[null,"Múrhúð",{"$f":"'3. Þykkt einangrunar'!G11","v":0.02},{"$f":"'3. Þykkt einangrunar'!H11","v":1.4},{"$f":"C58/D58","v":1.4285714285714287E-2},{"$f":"(E58/$E$71)*($G$52-$G$70)","v":-6.8571428571428589E-2},null,null,1.5E-6,{"$f":"C58/I58","v":13333.333333333334},{"$f":"($L$70-$L$52)*(J58/$J$71)","v":0.17496579096726811}]
[null,"……………………………..skil",null,null,null,null,{"$f":"G57-F58","v":10.262171428571429},9.5097266207399542,null,null,null,{"$f":"L57+K58","v":7.7095462735478728},81.070114641718177,{"$f":"IF(M59>100,\"Döggvun\",\"OK\")","v":"OK"}]
[null,"Járnbent steinsteypa",{"$f":"'3. Þykkt einangrunar'!G12","v":0.18},{"$f":"'3. Þykkt einangrunar'!H12","v":1.95},9.2307692307692313E-2,{"$f":"(E60/$E$71)*($G$52-$G$70)","v":-0.44307692307692315},null,null,1.1999999999999999E-6,150000,{"$f":"($L$70-$L$52)*(J60/$J$71)","v":1.9683651483817663}]
[null,"……………………………..skil",null,null,null,null,{"$f":"G59-F60","v":10.705248351648352},9.7752972519923205,null,null,null,{"$f":"L59+K60","v":9.6779114219296396},99.003755818854174,{"$f":"IF(M61>100,\"Döggvun\",\"OK\")","v":"OK"}]
[null,"Frauðplast",{"$f":"'3. Þykkt einangrunar'!G13","v":8.588735714285714E-2},{"$f":"'3. Þykkt einangrunar'!H13","v":3.9E-2},2.2022399267399266,{"$f":"(E62/$E$71)*($G$52-$G$70)","v":-10.570751648351649},null,null,2.5000000000000002E-6,34354.942857142851,{"$f":"($L$70-$L$52)*(J62/$J$71)","v":0.45082048129764729}]
[null,"……………………………..skil",null,null,null,null,{"$f":"G61-F62","v":21.276000000000003},{"$f":"0.0004*G63^3+0.0026*G63^2+0.4443*G63+4.2647","v":18.746951302630404},null,null,null,{"$f":"L61+K62","v":10.128731903227287},54.028688396956113,{"$f":"IF(M63>100,\"Döggvun\",\"OK\")","v":"OK"}]
[null,"Múrhúð",{"$f":"'3. Þykkt einangrunar'!G14","v":2.5000000000000001E-2},{"$f":"'3. Þykkt einangrunar'!H14","v":1.2},2.0833333333333336E-2,{"$f":"(E64/$E$71)*($G$52-$G$70)","v":-0.10000000000000002},null,null,1.5E-6,16666.666666666668,{"$f":"($L$70-$L$52)*(J64/$J$71)","v":0.21870723870908512}]
[null,"……………………………..skil",null,null,null,null,{"$f":"G63-F64","v":21.376000000000005},{"$f":"0.0004*G65^3+0.0026*G65^2+0.4443*G65+4.2647","v":18.857046715750407},null,null,null,{"$f":"L63+K64","v":10.347439141936372},54.873063093669074,{"$f":"IF(M65>100,\"Döggvun\",\"OK\")","v":"OK"}]
[null,"Málning (Alkyd)",2.0000000000000001E-4,null,null,{"$f":"(E66/$E$71)*($G$52-$G$70)","v":0},null,null,null,{"$f":"25000","v":25000},{"$f":"($L$70-$L$52)*(J66/$J$71)","v":0.32806085806362767}]
[null,"……………………………..skil",null,null,null,null,{"$f":"G65-F66","v":21.376000000000005},18.857046715750407,null,null,null,{"$f":"L65+K66","v":10.6755},56.612788635047792,{"$f":"IF(M67>100,\"Döggvun\",\"OK\")","v":"OK"}]
[null,"Innra yfirborð",null,null,{"$f":"'3. Þykkt einangrunar'!I15","v":0.13},{"$f":"(E68/$E$71)*($G$52-$G$70)","v":-0.62400000000000011}]
[]
[null,"Hitastig inni",null,null,null,null,{"$f":"C9","v":22},19.41,null,null,null,{"$f":"D9*H70/100","v":10.6755},54.999999999999993,{"$f":"IF(M70>100,\"Döggvun\",\"OK\")","v":"OK"}]
[null,null,null,null,{"$f":"SUM(E52:E70)","v":2.5},{"$f":"SUM(F52:F70)","v":-12.000000000000002},null,null,null,{"$f":"SUM(J56:J66)","v":240466.05396825395},{"$f":"SUM(K52:K70)","v":3.1555}]
[null,"Mat á rakaflutningi"]
[null,"Rakaflutningur inn (ginn)",0,"kg/m2s"]
[null,"Rakaflutningur út (gút)",0,"kg/m2s"]
[null,"Uppsafnað (guppsafnað)",{"$f":"((L70-L52)/(J71))*0.001","v":1.3122434322545108E-8},"kg/m2s"]
[null,"Sekúndur per mánuð",{"$f":"60*60*24*30","v":2592000},"s/mán"]
[null,"Raki per mánuð (vetur)",{"$f":"C75*C76","v":3.4013349764036922E-2},"kg/m2mán"]
[null,"Raki per mánuð (vetur)",{"$f":"C77*1000","v":34.013349764036924},"g/m2mán"]
[]
[]
[]
[]
[]
[]
[]
[]
[]
[]
[]
[]
[]
[]
[]
[]
[]
[]
[]
[]
[]
[]
[]
[]
[]
[]
[]
[]
[]
[]
[null,"VETUR"]
[null,"Steyptur veggur einangraður að utan - Hitastig á efnisskilum"]
[null,null,"d","λ","R","ΔT","T",null,null,"Z",null,null,"HR"]
[null,null,"m","W/mK",null,"°C","°C",null,null,"s/m",null,null,"%"]
[null,"Hitastig úti",null,null,null,null,{"$f":"C7","v":-2},4.13,null,null,null,{"$f":"(D7*H113)/100","v":3.3039999999999998},{"$f":"(L113/H113)*100","v":80},{"$f":"IF(M113>100,\"Döggvun\",\"OK\")","v":"OK"}]
[]
[null,"Ytra yfirborð",null,null,{"$f":"'3. Þykkt einangrunar'!I48","v":0.13},{"$f":"(E115/$E$132)*($G$113-$G$131)","v":-0.81094698454082348}]
[null,"……………………………..skil",null,null,null,null,{"$f":"G113-F115","v":-1.1890530154591765},{"$f":"-0.0039*G116^3-0.0055*G116^2+0.3577*G116+4.8343","v":4.4077560200578985},null,null,null,{"$f":"L113","v":3.3039999999999998},{"$f":"(L116/H116)*100","v":74.958776868883945},{"$f":"IF(M116>100,\"Döggvun\",\"OK\")","v":"OK"}]
[null,"Máling (Akryl)",1E-3,1,{"$f":"C117/D117","v":1E-3},{"$f":"(E117/$E$132)*($G$113-$G$131)","v":-6.2380537272371025E-3},null,null,null,{"$f":"25000","v":25000},{"$f":"($L$131-$L$113)*(J117/$J$132)","v":0.37719573609962831}]
[null,"……………………………..skil",null,null,null,null,{"$f":"G116-F117","v":-1.1828149617319395},{"$f":"-0.0039*G118^3-0.0055*G118^2+0.3577*G118+4.8343","v":4.4099660994557919},null,null,null,{"$f":"L116+K117","v":3.6811957360996281},83.474467900193233,{"$f":"IF(M118>100,\"Döggvun\",\"OK\")","v":"OK"}]
[null,"Klæðning",{"$f":"'4. Hiti á efnisskilum'!AB9","v":0.02},{"$f":"'4. Hiti á efnisskilum'!AC9","v":0.16},null,0,null,null,1.15E-6,{"$f":"C119/I119","v":17391.304347826088},{"$f":"($L$131-$L$113)*(J119/$J$132)","v":0.2623970338084371}]
[null,"……………………………..skil",null,null,null,null,{"$f":"G118-F119","v":-1.1828149617319395},4.4099660994557919,null,null,null,{"$f":"L118+K119","v":3.9435927699080651},89.42455975783399,{"$f":"IF(M120>100,\"Döggvun\",\"OK\")","v":"OK"}]
[null,"Loftræst bil (mikið)",{"$f":"'4. Hiti á efnisskilum'!AB11","v":0.02},null,null,0,null,null,2.5000000000000001E-5,{"$f":"C121/I121","v":800},1.2070263555188107E-2]
[null,"……………………………..skil",null,null,null,null,{"$f":"G120-F121","v":-1.1828149617319395},4.4099660994557919,null,null,null,{"$f":"L120+K121","v":3.955663033463253},89.698263983285457,{"$f":"IF(M122>100,\"Döggvun\",\"OK\")","v":"OK"}]
[null,"Steinull, veggplata",{"$f":"'4. Hiti á efnisskilum'!AB13","v":0.12228461538461539},{"$f":"'4. Hiti á efnisskilum'!AC13","v":3.5000000000000003E-2},{"$f":"C123/D123","v":3.4938461538461536},-21.794800022393016,null,null,1.6500000000000001E-5,7411.1888111888111,0.11181875276038772]
[null,"……………………………..skil",null,null,null,null,{"$f":"G122-F123","v":20.611985060661077},{"$f":"0.0004*G124^3+0.0026*G124^2+0.4443*G124+4.2647","v":18.030058303539587},null,null,null,{"$f":"L122+K123","v":4.0674817862236408},22.559448881122751,{"$f":"IF(M124>100,\"Döggvun\",\"OK\")","v":"OK"}]
[null,"Járnbent steinsteypa",{"$f":"'4. Hiti á efnisskilum'!AB15","v":0.18},{"$f":"'4. Hiti á efnisskilum'!AC15","v":1.95},{"$f":"C125/D125","v":9.2307692307692313E-2},-0.5758203440526557,null,null,1.1999999999999999E-6,150000,2.2631744165977699]
[null,"……………………………..skil",null,null,null,null,{"$f":"G124-F125","v":21.187805404713732},{"$f":"0.0004*G126^3+0.0026*G126^2+0.4443*G126+4.2647","v":18.65032009149467},null,null,null,{"$f":"L124+K125","v":6.3306562028214106},33.943954697637899,{"$f":"IF(M126>100,\"Döggvun\",\"OK\")","v":"OK"}]
[null,"Málning (Alkyd)",2.0000000000000001E-4,1,{"$f":"C127/D127","v":2.0000000000000001E-4},-1.2476107454474205E-3,null,null,null,95000,1.4333437971785876]
[null,"……………………………..skil",null,null,null,null,{"$f":"G126-F127","v":21.18905301545918},18.651684003604196,null,null,null,{"$f":"L126+K127","v":7.7639999999999985},41.626268161629298,{"$f":"IF(M128>100,\"Döggvun\",\"OK\")","v":"OK"}]
[null,"Innra yfirborð",null,null,{"$f":"'3. Þykkt einangrunar'!I55","v":0.13},-0.81094698454082348]
[]
[null,"Hitastig inni",null,null,null,null,{"$f":"C6","v":22},19.41,null,null,null,{"$f":"(D6*H131)/100","v":7.7639999999999993},40,{"$f":"IF(M131>100,\"Döggvun\",\"OK\")","v":"OK"}]
[null,null,null,null,{"$f":"SUM(E113:E130)","v":3.8473538461538457},{"$f":"SUM(F113:F131)","v":-24.000000000000004},null,null,null,{"$f":"SUM(J113:J131)","v":295602.49315901491},{"$f":"SUM(K113:K131)","v":4.4599999999999991}]
[null,"Mat á rakaflutningi"]
[null,"Rakaflutningur inn (ginn)",0,"kg/m2s"]
[null,"Rakaflutningur út (gút)",0,"kg/m2s"]
[null,"Uppsafnað (guppsafnað)",{"$f":"((L131-L113)/J132)*0.001","v":1.5087829443985135E-8},"kg/m2s"]
[null,"Sekúndur per mánuð",{"$f":"60*60*24*30","v":2592000},"s/mán"]
[null,"Raki per mánuð (vetur)",{"$f":"C136*C137","v":3.9107653918809472E-2},"kg/m2mán"]
[null,"Raki per mánuð (vetur)",{"$f":"C138*1000","v":39.107653918809476},"g/m2mán"]
[]
[]
[]
[]
[null,"Sumar"]
[null,"Steyptur veggur einangraður að utan - Hitastig á efnisskilum"]
[null,null,"d","λ","R","ΔT","T",null,null,"Z",null,null,"HR"]
[null,null,"m","W/mK",null,"°C","°C",null,null,"s/m",null,null,"%"]
[null,"Hitastig úti",null,null,null,null,{"$f":"C10","v":10},9.4,null,null,null,{"$f":"(D10*H148)/100","v":7.52},{"$f":"(L148/H148)*100","v":80},{"$f":"IF(M148>100,\"Döggvun\",\"OK\")","v":"OK"}]
[]
[null,"Ytra yfirborð",null,null,{"$f":"'3. Þykkt einangrunar'!I48","v":0.13},{"$f":"(E150/$E$167)*($G$148-$G$166)","v":-0.40547349227041174}]
[null,"……………………………..skil",null,null,null,null,{"$f":"G148-F150","v":10.405473492270412},{"$f":"0.000003*G151^4+0.0001*G151^3+0.0102*G151^2+0.3387*G151+4.8184","v":9.5949612292612994},null,null,null,{"$f":"L148","v":7.52},{"$f":"(L151/H151)*100","v":78.37446989432965},{"$f":"IF(M151>100,\"Döggvun\",\"OK\")","v":"OK"}]
[null,"Máling (Akryl)",1E-3,1,{"$f":"C152/D152","v":1E-3},{"$f":"(E152/$E$167)*($G$148-$G$166)","v":-3.1190268636185512E-3},null,null,null,{"$f":"25000","v":25000},{"$f":"($L$166-$L$148)*(J152/$J$167)","v":0.26687021194223709}]
[null,"……………………………..skil",null,null,null,null,{"$f":"G151-F152","v":10.40859251913403},{"$f":"0.000003*G153^4+0.0001*G153^3+0.0102*G153^2+0.3387*G153+4.8184","v":9.5968233542538748},null,null,null,{"$f":"L151+K152","v":7.7868702119422366},81.140080675660656,{"$f":"IF(M153>100,\"Döggvun\",\"OK\")","v":"OK"}]
[null,"Klæðning",{"$f":"'3. Þykkt einangrunar'!G49","v":0.02},null,null,0,null,null,1.15E-6,{"$f":"C154/I154","v":17391.304347826088},{"$f":"($L$166-$L$148)*(J154/$J$167)","v":0.1856488430902519}]
[null,"……………………………..skil",null,null,null,null,{"$f":"G153-F154","v":10.40859251913403},9.5968233542538748,null,null,null,{"$f":"L153+K154","v":7.9725190550324889},83.074562912514182,{"$f":"IF(M155>100,\"Döggvun\",\"OK\")","v":"OK"}]
[null,"Loftræst bil (mikið)",{"$f":"'3. Þykkt einangrunar'!G50","v":0.02},null,null,0,null,null,2.5000000000000001E-5,{"$f":"C156/I156","v":800},8.5398467821515868E-3]
[null,"……………………………..skil",null,null,null,null,{"$f":"G155-F156","v":10.40859251913403},9.5968233542538748,null,null,null,{"$f":"L155+K156","v":7.9810589018146407},83.163549095409451,{"$f":"IF(M157>100,\"Döggvun\",\"OK\")","v":"OK"}]
[null,"Steinull, veggplata",{"$f":"'3. Þykkt einangrunar'!G51","v":0.12228461538461539},{"$f":"'3. Þykkt einangrunar'!H51","v":3.5000000000000003E-2},{"$f":"C158/D158","v":3.4938461538461536},-10.897400011196508,null,null,1.6500000000000001E-5,7411.1888111888111,7.9113021151435758E-2]
[null,"……………………………..skil",null,null,null,null,{"$f":"G157-F158","v":21.305992530330538},{"$f":"0.0004*G159^3+0.0026*G159^2+0.4443*G159+4.2647","v":18.779912526511563},null,null,null,{"$f":"L157+K158","v":8.0601719229660773},42.919113236483661,{"$f":"IF(M159>100,\"Döggvun\",\"OK\")","v":"OK"}]
[null,"Járnbent steinsteypa",{"$f":"'3. Þykkt einangrunar'!G54","v":0.18},{"$f":"'3. Þykkt einangrunar'!H54","v":1.95},{"$f":"C160/D160","v":9.2307692307692313E-2},-0.28791017202632785,null,null,1.1999999999999999E-6,150000,1.6012212716534224]
[null,"……………………………..skil",null,null,null,null,{"$f":"G159-F160","v":21.593902702356868},{"$f":"0.0004*G161^3+0.0026*G161^2+0.4443*G161+4.2647","v":19.098907876158293},null,null,null,{"$f":"L159+K160","v":9.6613931946194995},50.586102918900878,{"$f":"IF(M161>100,\"Döggvun\",\"OK\")","v":"OK"}]
[null,"Málning (Alkyd)",2.0000000000000001E-4,1,{"$f":"C162/D162","v":2.0000000000000001E-4},-6.2380537272371025E-4,null,null,null,95000,1.0141068053805009]
[null,"……………………………..skil",null,null,null,null,{"$f":"G161-F162","v":21.59452650772959},19.099604144036469,null,null,null,{"$f":"L161+K162","v":10.6755},55.893828581432899,{"$f":"IF(M163>100,\"Döggvun\",\"OK\")","v":"OK"}]
[null,"Innra yfirborð",null,null,{"$f":"'3. Þykkt einangrunar'!I55","v":0.13},-0.40547349227041174]
[]
[null,"Hitastig inni",null,null,null,null,{"$f":"C9","v":22},19.41,null,null,null,{"$f":"(D9*H166)/100","v":10.6755},54.999999999999993,{"$f":"IF(M166>100,\"Döggvun\",\"OK\")","v":"OK"}]
[null,null,null,null,{"$f":"SUM(E148:E165)","v":3.8473538461538457},{"$f":"SUM(F148:F166)","v":-12.000000000000002},null,null,null,{"$f":"SUM(J148:J166)","v":295602.49315901491},{"$f":"SUM(K148:K166)","v":3.1555}]
[null,"Mat á rakaflutningi"]
[null,"Rakaflutningur inn (ginn)",0,"kg/m2s"]
[null,"Rakaflutningur út (gút)",0,"kg/m2s"]
[null,"Uppsafnað (guppsafnað)",{"$f":"((L166-L148)/J167)*0.001","v":1.0674808477689484E-8},"kg/m2s"]
[null,"Sekúndur per mánuð",{"$f":"60*60*24*30","v":2592000},"s/mán"]
[null,"Raki per mánuð (vetur)",{"$f":"C171*C172","v":2.7669103574171145E-2},"kg/m2mán"]
[null,"Raki per mánuð (vetur)",{"$f":"C173*1000","v":27.669103574171146},"g/m2mán"]

{"sheet":"8. Raki_mettunarþrýst","index":7,"n_rows":79,"n_cols":15,"rows_kept":79,"cut":false,"hidden":true,"merged":[[12,1,12,6],[49,1,49,6]]}
[]
[null,"Reikningar miðast við eftirfarandi umhverfisaðstæður"]
[]
[null,null,"Lofthiti (°C)","Loftraki (%HR)"]
[null,"Vetur"]
[null,"Inni",22,40]
[null,"Úti",-2,80]
[null,"Sumar"]
[null,"Inni",22,55]
[null,"Úti",10,80]
[]
[null,"VETUR"]
[null,"Steyptur veggur einangraður að innan - Hitastig á efnisskilum"]
[null,null,"d","λ","R","ΔT","T",null,null,null,"Z","Rakaþrýst","Mettunarþr.","HR"]
[null,null,"m","W/mK",null,"°C","°C","-",null,null,"s/m","Pa","Pa","%"]
[null,"Hitastig úti",null,null,null,null,{"$f":"C7","v":-2},null,null,null,null,{"$f":"(N16/100)*M16","v":413.6},517,{"$f":"D7","v":80},{"$f":"IF(N16>100,\"Döggvun\",\"OK\")","v":"OK"}]
[]
[null,"Ytra yfirborð",null,null,{"$f":"'3. Þykkt einangrunar'!I9","v":0.04},{"$f":"(E18/$E$35)*($G$16-$G$34)","v":-0.38400000000000001},null,null,1.9E-3,{"$f":"0.0000002*(((273.15+G16)^0.81)/(101325))","v":1.8459212371567772E-10},{"$f":"I18/J18","v":10292963.544460429}]
[null,"……………………………..skil",null,null,null,null,{"$f":"G16-F18","v":-1.6160000000000001},null,null,null,null,{"$f":"$L$34-((K20+K22+K24+K26+K28+K30+K32)/($K$35)*($L$34-$L$16))","v":413.65671198433927},{"$f":"-0.0000001*G19^6+0.000004*G19^5+0.0005*G19^4+0.0231*G19^3+1.3647*G19^2+45.923*G19+603.97","v":533.2281653830305},{"$f":"(L19/M19)*100","v":77.575930687607212},{"$f":"IF(N19>100,\"Döggvun\",\"OK\")","v":"OK"}]
[null,"Marmarasalli",{"$f":"'3. Þykkt einangrunar'!G10","v":1E-3},{"$f":"'3. Þykkt einangrunar'!H10","v":3},{"$f":"C20/D20","v":3.3333333333333332E-4},{"$f":"(E20/$E$35)*($G$16-$G$34)","v":-3.2000000000000002E-3},null,200,null,{"$f":"0.0000002*(((273.15+G19)^0.81)/(101325))","v":1.8480384347935411E-10},{"$f":"(C20*H20)/J20","v":1082228574.0087628}]
[null,"……………………………..skil",null,null,null,null,{"$f":"G19-F20","v":-1.6128},null,null,null,null,{"$f":"$L$34-((K22+K24+K26+K28+K30+K32)/($K$35)*($L$34-$L$16))","v":419.61955540407416},{"$f":"-0.0000001*G21^6+0.000004*G21^5+0.0005*G21^4+0.0231*G21^3+1.3647*G21^2+45.923*G21+603.97","v":533.36157018193921},{"$f":"(L21/M21)*100","v":78.67450128829762},"OK"]
[null,"Múrhúð",{"$f":"'3. Þykkt einangrunar'!G11","v":0.02},{"$f":"'3. Þykkt einangrunar'!H11","v":1.4},{"$f":"C22/D22","v":1.4285714285714287E-2},-0.13714285714285718,null,15,null,{"$f":"0.0000002*(((273.15+G21)^0.81)/(101325))","v":1.8480560757160795E-10},{"$f":"(C22*H22)/J22","v":1623327365.1274724}]
[null,"……………………………..skil",null,null,null,null,{"$f":"G21-F22","v":-1.4756571428571428},null,null,null,null,{"$f":"$L$34-((K24+K26+K28+K30+K32)/($K$35)*($L$34-$L$16))","v":428.56373515472603},539.10323238984938,{"$f":"(L23/M23)*100","v":79.495671590559596},"OK"]
[null,"Járnbent steinsteypa",{"$f":"'3. Þykkt einangrunar'!G12","v":0.18},{"$f":"'3. Þykkt einangrunar'!H12","v":1.95},9.2307692307692313E-2,-0.88615384615384629,null,82,null,{"$f":"0.0000002*(((273.15+G23)^0.81)/(101325))","v":1.8488120781388755E-10},79835047458.464767]
[null,"……………………………..skil",null,null,null,null,{"$f":"G23-F24","v":-0.58950329670329649},null,null,null,null,{"$f":"$L$34-((K26+K28+K30+K32)/($K$35)*($L$34-$L$16))","v":868.43743543837729},577.36782045924417,{"$f":"(L25/M25)*100","v":150.41320362253882},"Döggvun"]
[null,"Frauðplast",{"$f":"'3. Þykkt einangrunar'!G13","v":8.588735714285714E-2},{"$f":"'3. Þykkt einangrunar'!H13","v":3.9E-2},2.2022399267399266,-21.141503296703299,null,29,null,{"$f":"0.0000002*(((273.15+G25)^0.81)/(101325))","v":1.853695270885814E-10},13436584730.30805]
[null,"……………………………..skil",null,null,null,null,{"$f":"G25-F26","v":20.552000000000003},null,null,null,null,{"$f":"$L$34-((K28+K30+K32)/($K$35)*($L$34-$L$16))","v":942.47008691980056},2421.070883059293,{"$f":"(L27/M27)*100","v":38.927818822424747},"OK"]
[null,"Múrhúð",{"$f":"'3. Þykkt einangrunar'!G14","v":2.5000000000000001E-2},{"$f":"'3. Þykkt einangrunar'!H14","v":1.2},2.0833333333333336E-2,-0.20000000000000004,null,150,null,{"$f":"0.0000002*(((273.15+G27)^0.81)/(101325))","v":1.969327635674168E-10},19042032072.617756]
[null,"……………………………..skil",null,null,null,null,{"$f":"G27-F28","v":20.752000000000002},null,null,null,null,{"$f":"$L$34-((K30+K32)/($K$35)*($L$34-$L$16))","v":1047.3875307662529},2451.2405768126673,{"$f":"(L29/M29)*100","v":42.728875356990223},"OK"]
[null,"Málning (Alkyd)",2.0000000000000001E-4,null,null,0,null,null,0.3,{"$f":"0.0000002*(((273.15+G29)^0.81)/(101325))","v":1.9704138061598227E-10},{"$f":"I30/J30","v":1522522827.7540126}]
[null,"……………………………..skil",null,null,null,null,{"$f":"G29-F30","v":20.752000000000002},null,null,null,null,{"$f":"$L$34-(K32/$K$35)*($L$34-$L$16)","v":1055.7762995004221},2451.2405768126673,{"$f":"(L31/M31)*100","v":43.071100792287034},"OK"]
[null,"Innra yfirborð",null,null,{"$f":"'3. Þykkt einangrunar'!I15","v":0.13},-1.2480000000000002,null,null,8.0000000000000002E-3,{"$f":"0.0000002*(((273.15+G31)^0.81)/(101325))","v":1.9704138061598227E-10},{"$f":"I32/J32","v":40600608.740107}]
[]
[null,"Hitastig inni",null,null,null,null,{"$f":"C6","v":22},null,null,null,null,{"$f":"(N34/100)*M34","v":1056},2640,{"$f":"D6","v":40},"OK"]
[null,null,null,null,{"$f":"SUM(E16:E34)","v":2.5},{"$f":"SUM(F16:F34)","v":-24.000000000000004},null,null,null,null,{"$f":"SUM(K16:K34)","v":116592636600.56538},{"$f":"SUM(L16:L34)","v":6645.5113551679924}]
[null,"Mat á útþornun veggjar"]
[null,"Rakaflutningur inn (ginn)",{"$f":"((L34-M25)/(K32+K30+K28+K26))","v":1.4060156037102518E-8},"kg/m2s"]
[null,"Rakaflutningur út (gút)",{"$f":"((M25-L16)/(K18+K20+K22+K24))","v":1.9838406083780015E-9},"kg/m2s"]
[null,"Uppsafnað (guppsafnað)",{"$f":"C37-C38","v":1.2076315428724516E-8},"kg/m2s"]
[null,"Sekúndur per mánuð",{"$f":"60*60*24*30","v":2592000},"s/mán"]
[null,"Raki per mánuð (vetur)",{"$f":"C39*C40","v":3.1301809591253948E-2},"kg/m2mán"]
[null,"Raki per mánuð (vetur)",{"$f":"C41*1000","v":31.301809591253949},"g/m2mán"]
[]
[]
[]
[]
[]
[]
[null,"SUMAR"]
[null,"Steyptur veggur einangraður að innan - Hitastig á efnisskilum"]
[null,null,"d","λ","R","ΔT","T",null,null,null,"Z","Rakaþrýst","Mettunarþr.","HR"]
[null,null,"m","W/mK",null,"°C","°C","-",null,null,"s/m","Pa","Pa","%"]
[null,"Hitastig úti",null,null,null,null,{"$f":"C10","v":10},null,null,null,null,{"$f":"(N53/100)*M53","v":982.40000000000009},1228,{"$f":"D10","v":80},{"$f":"IF(N53>100,\"Döggvun\",\"OK\")","v":"OK"}]
[]
[null,"Ytra yfirborð",null,null,{"$f":"'3. Þykkt einangrunar'!I9","v":0.04},{"$f":"(E55/$E$72)*($G$53-$G$71)","v":-0.192},null,null,1.9E-3,{"$f":"0.0000002*(((273.15+G53)^0.81)/(101325))","v":1.9118191245412841E-10},{"$f":"I55/J55","v":9938178.6467685848}]
[null,"……………………………..skil",null,null,null,null,{"$f":"G53-F55","v":10.192},null,null,null,null,{"$f":"$L$71-((K57+K59+K61+K63+K65+K67+K69)/$K$72)*($L$71-$L$53)","v":982.2319885223078},{"$f":"-0.0000001*G56^6+0.000004*G56^5+0.0005*G56^4+0.0231*G56^3+1.3647*G56^2+45.923*G56+603.97","v":1243.9572598124469},{"$f":"(L56/M56)*100","v":78.960268190436082},{"$f":"IF(N56>100,\"Döggvun\",\"OK\")","v":"OK"}]
[null,"Marmarasalli",{"$f":"'3. Þykkt einangrunar'!G10","v":1E-3},{"$f":"'3. Þykkt einangrunar'!H10","v":3},{"$f":"C57/D57","v":3.3333333333333332E-4},{"$f":"(E57/$E$72)*($G$53-$G$71)","v":-1.6000000000000001E-3},null,200,null,{"$f":"0.0000002*(((273.15+G56)^0.81)/(101325))","v":1.912869122641936E-10},{"$f":"(C57*H57)/J57","v":1045549837.323802}]
[null,"……………………………..skil",null,null,null,null,{"$f":"G56-F57","v":10.1936},null,null,null,null,{"$f":"$L$71-((K59+K61+K63+K65+K67+K69)/$K$72)*($L$71-$L$53)","v":986.56607162525188},1244.0903971152502,{"$f":"(L58/M58)*100","v":79.300191844006193},{"$f":"IF(N58>100,\"Döggvun\",\"OK\")","v":"OK"}]
[null,"Múrhúð",{"$f":"'3. Þykkt einangrunar'!G11","v":0.02},{"$f":"'3. Þykkt einangrunar'!H11","v":1.4},{"$f":"C59/D59","v":1.4285714285714287E-2},-6.8571428571428589E-2,null,15,null,{"$f":"0.0000002*(((273.15+G58)^0.81)/(101325))","v":1.9128778720580237E-10},{"$f":"(C59*H59)/J59","v":1568317582.5398436}]
[null,"……………………………..skil",null,null,null,null,{"$f":"G58-F59","v":10.262171428571429},null,null,null,null,{"$f":"$L$71-((K61+K63+K65+K67+K69)/$K$72)*($L$71-$L$53)","v":993.06716654382058},1249.8078878065191,79.457585140281637,{"$f":"IF(N60>100,\"Döggvun\",\"OK\")","v":"OK"}]
[null,"Járnbent steinsteypa",{"$f":"'3. Þykkt einangrunar'!G12","v":0.18},{"$f":"'3. Þykkt einangrunar'!H12","v":1.95},9.2307692307692313E-2,-0.44307692307692315,null,82,null,{"$f":"0.0000002*(((273.15+G60)^0.81)/(101325))","v":1.9132528382119123E-10},77146102727.302887]
[null,"……………………………..skil",null,null,null,null,{"$f":"G60-F61","v":10.705248351648352},null,null,null,null,{"$f":"$L$71-((K63+K65+K67+K69)/$K$72)*($L$71-$L$53)","v":1312.8583504286737},1287.3038226547142,101.98512016543695,{"$f":"IF(N62>100,\"Döggvun\",\"OK\")","v":"Döggvun"}]
[null,"Frauðplast",{"$f":"'3. Þykkt einangrunar'!G13","v":8.588735714285714E-2},{"$f":"'3. Þykkt einangrunar'!H13","v":3.9E-2},2.2022399267399266,-10.570751648351649,null,29,null,{"$f":"0.0000002*(((273.15+G62)^0.81)/(101325))","v":1.9156752811319989E-10},13001855699.004732]
[null,"……………………………..skil",null,null,null,null,{"$f":"G62-F63","v":21.276000000000003},null,null,null,null,{"$f":"$L$71-((K65+K67+K69)/$K$72)*($L$71-$L$53)","v":1366.7545121230899},2531.8765863652798,53.98187729541668,{"$f":"IF(N64>100,\"Döggvun\",\"OK\")","v":"OK"}]
[null,"Múrhúð",{"$f":"'3. Þykkt einangrunar'!G14","v":2.5000000000000001E-2},{"$f":"'3. Þykkt einangrunar'!H14","v":1.2},2.0833333333333336E-2,-0.10000000000000002,null,150,null,{"$f":"0.0000002*(((273.15+G64)^0.81)/(101325))","v":1.9732589071896336E-10},19004095135.903111]
[null,"……………………………..skil",null,null,null,null,{"$f":"G64-F65","v":21.376000000000005},null,null,null,null,{"$f":"$L$71-((K67+K69)/$K$72)*($L$71-$L$53)","v":1445.5315581088489},2547.5301954712004,56.742470047208926,{"$f":"IF(N66>100,\"Döggvun\",\"OK\")","v":"OK"}]
[null,"Málning (Alkyd)",2.0000000000000001E-4,null,null,0,null,null,0.3,{"$f":"0.0000002*(((273.15+G66)^0.81)/(101325))","v":1.9738017560377205E-10},{"$f":"I67/J67","v":1519909479.6745474}]
[null,"……………………………..skil",null,null,null,null,{"$f":"G66-F67","v":21.376000000000005},null,null,null,null,{"$f":"$L$71-(K69/$K$72)*($L$71-$L$53)","v":1451.8319885223079},{"$f":"-0.0000001*G68^6+0.000004*G68^5+0.0005*G68^4+0.0231*G68^3+1.3647*G68^2+45.923*G68+603.97","v":2547.5301954712004},56.98978528706985,{"$f":"IF(N68>100,\"Döggvun\",\"OK\")","v":"OK"}]
[null,"Innra yfirborð",null,null,{"$f":"'3. Þykkt einangrunar'!I15","v":0.13},-0.62400000000000011,null,null,8.0000000000000002E-3,{"$f":"0.0000002*(((273.15+G68)^0.81)/(101325))","v":1.9738017560377205E-10},{"$f":"I69/J69","v":40530919.457987934}]
[]
[null,"Hitastig inni",null,null,null,null,{"$f":"C9","v":22},null,null,null,null,{"$f":"(N71/100)*M71","v":1452.0000000000002},2640,{"$f":"D9","v":55},{"$f":"IF(N71>100,\"Döggvun\",\"OK\")","v":"OK"}]
[null,null,null,null,{"$f":"SUM(E53:E71)","v":2.5},{"$f":"SUM(F53:F71)","v":-12.000000000000002},null,null,null,null,{"$f":"SUM(K57:K67)","v":113285830461.74892},{"$f":"SUM(L53:L71)","v":10973.241635874299}]
[null,"Mat á útþornun veggjar"]
[null,"Rakaflutningur inn (ginn)",{"$f":"(L71-M62)/(K69+K67+K65+K63)","v":4.9065798046905994E-9},"kg/m2s"]
[null,"Rakaflutningur út (gút)",{"$f":"((M62-L53)/(K55+K57+K59+K61))","v":3.8222912505974151E-9},"kg/m2s"]
[null,"Uppsafnað (guppsafnað)",{"$f":"((M71-M53)/(K72))","v":1.246404774758449E-8},"kg/m2s"]
[null,"Sekúndur per mánuð",{"$f":"60*60*24*30","v":2592000},"s/mán"]
[null,"Raki per mánuð (vetur)",{"$f":"C76*C77","v":3.2306811761738996E-2},"kg/m2mán"]
[null,"Raki per mánuð (vetur)",{"$f":"C78*1000","v":32.306811761738999},"g/m2mán"]

{"sheet":"9. Alg. leiðnitölur","index":8,"n_rows":66,"n_cols":9,"rows_kept":66,"cut":false,"hidden":false,"merged":[[0,0,0,4]]}
["Algengar varmaleiðnitölur  (auk  U gilda fyrir gluggagler)"]
[]
["Efni","Eðlisþéttleiki bil [kg/m3]","Algengasti eðlisþéttleiki [kg/m3]","Leiðnitala bil [W/mK]","Leiðnitala [W/mK]"]
["Steinsteypa, múrhúð"]
["Steypa, bent og óbent","2200-2300",2300,"1,7-1,95",1.95]
["Múrhúð rök (sement/sandur)","1800-1900",1900,1.4,1.4]
["Múrhúð þurr (sement/sandur)","1800-1900",1900,1.2,1.2]
["Múrhúð, kalk sement og sandur",1800,1800,1,1]
["Léttsteypa"]
["Frauðsteypa","300-700",null,"0,13-0,25",0.2]
["Vikursteypa","500-1000",null,"0,20-0,30",0.26]
["Gjallsteypa","1000-1400",null,"0,33-0,55",0.5]
["Grjót, sandur og möl"]
["Basalt, blágrýti, grágrýti","2700-3000",null,"2,3-3,5"]
["Jarðvegur (rakur)","1500-2000",1900,"1,4-2,5",2.2999999999999998]
["Sandur","1700-2200",null,"1,5-2,0",2]
["Möl","1700-2200",null,"1,5-2,0",2]
["Tré og plötur úr tré"]
["Timbur","400-450",450,0.13,0.13]
["Harðar trétrefjaplötur",900,900,"0,13-0,14",0.13]
["Trétrefjaplötur MDF",600,600,"0,13-0,14",0.14000000000000001]
["Mjúkar trefjaplötur",300,300,null,0.05]
["Krossviður",500,500,0.13,0.13]
["Einangrunarefni"]
["Filtmottur",100,100,null,0.04]
["Einangrunarkorkur","140-200",null,"0,04-0,047"]
["Steinull"]
["Léttull",22,22,"0,040-0,042",4.2000000000000003E-2]
["Þéttull","30-35",32,3.9E-2,3.9E-2]
["Steinull (stíf)","80-",null,null,3.5999999999999997E-2]
["Plötur 100",100,100,null,3.6999999999999998E-2]
["Plötur 200",200,200,null,3.6999999999999998E-2]
["Frauðplast (polystyren)","20-25",null,null,3.5999999999999997E-2]
["Polyurethan frauð","28-55",null,"0,024-0,028",2.4E-2]
["Ýmis byggingarefni"]
["Þakpappi"]
["tjöruborinn","700-800",800,null,0.17499999999999999]
["asfaltborinn",1100,1100,null,0.26]
["Gifs",1200,1200,null,0.52]
["Gifsplötur + pappír","800-900",800,"0,20-0,25",0.2]
["Þakdúkur (gúmmí PVC)"]
["mjúkur",null,1300,null,0.17499999999999999]
["harður",null,1400,"0,25-0,35",0.25]
["Málmar"]
["Álblöndur",2700,2700,null,175]
["Steypujárn",7200,7200,null,58]
["Ryðfrítt stál",null,7800,null,17]
["Annað"]
["Gólfteppi",200,null,null,0.06]
["Línóleum",1200,null,null,0.2]
["Acryl (t.d. Plexýgler)",1180,1180,null,0.2]
["Gúmmí","1100-1200",1100,null,0.17499999999999999]
["Kyrrstætt loft",1.23,1.23,"0,025-0,026",2.5999999999999999E-2,null,null,null," "]
["Argon",1.7,1.7,null,1.7000000000000001E-2]
["Ís (við 0°C)","900-910",null,null,2.2000000000000002]
["Vatn",1000,1000,"0,58-0,60",0.57999999999999996]
["Snjór","100-800",300,"0,058-1,3",0.23]
[]
[]
["Gler","U gildi      [W/m2K]"]
["Tvöfalt venjulegt (12 mm loftbil)",2.9]
["TopN+ (16 mm gasfyllt bil)",1.1000000000000001]
["Sólvarnargler - Energy N",1.1000000000000001]
["TopN+ (12 mm gasfyllt bil)",1.3]
["K gler (12 mm gasfyllt bil)",1.6]
["K gler (12 mm loftbil)",1.9]

{"sheet":"10. Veðurgögn","index":9,"n_rows":50,"n_cols":14,"rows_kept":50,"cut":false,"hidden":true,"merged":[[0,0,1,13],[34,2,34,3],[49,2,49,3]]}
["Veðurgögn - Gráðutímafjöldi"]
[]
[]
["Tafla 1     Veðurgögn frá sjálfvirkum veðurstöðvum fyrir árið 2012 (heimild Veðurstofa Íslands)"]
[null,"Janúar ","Febrúar","Mars","Apríl","Maí","Júní","Júlí","Ágúst","September","Október","Nóvember","Desember","Samtals"]
["Akureyri",14522.399999999998,12193.599999999991,12476.599999999991,13003.999999999993,10673.999999999996,8285.0000000000036,6435.5000000000009,5974.8000000000011,10050.399999999996,13180.999999999995,14942.100000000008,15608.199999999995,137347.59999999995]
["Egilsstaðir",14811.500000000002,12209.699999999997,12714.500000000011,13817.399999999989,11469.200000000008,9101.9,7229.7999999999947,6930.2999999999993,9941.2000000000025,13496.100000000008,14893.399999999981,16450.80000000001,143065.79999999999]
["Hella",15807.699999999999,12379.600000000011,12938.200000000015,11677,10404,6890.6999999999971,5518.9999999999991,6011.4000000000087,9728.9000000000015,12667.900000000011,14419.4,14799.299999999988,133243.10000000003]
["Ísafjörður",14862.099999999999,12995.200000000015,13486.299999999994,12923.399999999992,11086.499999999987,8398.8000000000102,6524.6999999999989,6710.5000000000036,10020.599999999999,12975.999999999987,14279.200000000006,14835.899999999991,139099.19999999995]
["Keflavík",14424.500000000015,12083.20000000001,12695.199999999977,11398.600000000008,10463.89999999998,6855.7999999999975,5795.800000000002,6077.6999999999935,9152.8000000000084,11474.500000000005,13282.599999999999,13647.399999999972,127351.99999999994]
["Reykjavík",14554.600000000006,12138.799999999992,12618.200000000006,11278,10167.100000000006,6702.5999999999995,5644.0000000000055,5691.4000000000015,9099.1999999999935,11550.800000000005,13304.500000000007,13861.799999999997,126611.00000000001]
[]
["Tafla 2"]
["Sjálfvirk uppfærsla gagna"]
["Valin röð",{"$f":"MATCH('6. Orkubúskapur'!H2,Staður,0)","v":6}]
[]
["Dálkur",1,2,3,4,5,6,7,8,9,10,11,12,"Samtals"]
[null,{"$f":"INDEX(Gráðutímar_mán,Valin_röð,$B$17)","v":14554.600000000006},{"$f":"INDEX(Gráðutímar_mán,Valin_röð,$C$17)","v":12138.799999999992},{"$f":"INDEX(Gráðutímar_mán,Valin_röð,$D$17)","v":12618.200000000006},{"$f":"INDEX(Gráðutímar_mán,Valin_röð,$E$17)","v":11278},{"$f":"INDEX(Gráðutímar_mán,Valin_röð,$F$17)","v":10167.100000000006},{"$f":"INDEX(Gráðutímar_mán,Valin_röð,$G$17)","v":6702.5999999999995},{"$f":"INDEX(Gráðutímar_mán,Valin_röð,$H$17)","v":5644.0000000000055},{"$f":"INDEX(Gráðutímar_mán,Valin_röð,$I$17)","v":5691.4000000000015},{"$f":"INDEX(Gráðutímar_mán,Valin_röð,$J$17)","v":9099.1999999999935},{"$f":"INDEX(Gráðutímar_mán,Valin_röð,$K$17)","v":11550.800000000005},{"$f":"INDEX(Gráðutímar_mán,Valin_röð,$L$17)","v":13304.500000000007},{"$f":"INDEX(Gráðutímar_mán,Valin_röð,$M$17)","v":13861.799999999997},{"$f":"SUM(B18:M18)","v":126611.00000000001}]
[]
["Tafla 3     Meðalhiti árs 2012"]
["Staður","Hiti (°C)"]
["Akureyri",4.4000000000000004]
["Egilsstaðir",3.7]
["Hella",4.8]
["Ísafjörður",4.2]
["Keflavík",5.5]
["Reykjavík",5.6]
[]
["Tafla 4"]
["Sjálfvirk uppfærla v. töflu 3"]
["Valin röð",{"$f":"MATCH('6. Orkubúskapur'!H2,Staður,0)","v":6}]
["Meðalhiti",{"$f":"INDEX(Meðalhiti_2012,B31)","v":5.6}]
[]
["Tafla 5     Sundurliðuð varmaþörf"]
[null,null,"Varmaþörf vegna: "]
["Mánuður","Gráðutímar","Loftskipti","Varmatap"]
["Janúar",{"$f":"B18","v":14554.600000000006},{"$f":"B37*'6. Orkubúskapur'!$B$34*0.001","v":1979.4256000000009},{"$f":"B37*'6. Orkubúskapur'!$B$24*0.001","v":2857.9774408980984}]
["Febrúar",{"$f":"C18","v":12138.799999999992},{"$f":"B38*'6. Orkubúskapur'!$B$34*0.001","v":1650.8767999999989},{"$f":"B38*'6. Orkubúskapur'!$B$24*0.001","v":2383.6049468603605}]
["Mars",{"$f":"D18","v":12618.200000000006},{"$f":"B39*'6. Orkubúskapur'!$B$34*0.001","v":1716.0752000000009},{"$f":"B39*'6. Orkubúskapur'!$B$24*0.001","v":2477.7411227199918}]
["Apríl",{"$f":"E18","v":11278},{"$f":"B40*'6. Orkubúskapur'!$B$34*0.001","v":1533.808},{"$f":"B40*'6. Orkubúskapur'!$B$24*0.001","v":2214.5761187836661}]
["Maí",{"$f":"F18","v":10167.100000000006},{"$f":"B41*'6. Orkubúskapur'!$B$34*0.001","v":1382.7256000000009},{"$f":"B41*'6. Orkubúskapur'!$B$24*0.001","v":1996.4370329212113}]
["Júní",{"$f":"G18","v":6702.5999999999995},{"$f":"B42*'6. Orkubúskapur'!$B$34*0.001","v":911.55359999999996},{"$f":"B42*'6. Orkubúskapur'!$B$24*0.001","v":1316.1391996594607}]
["Júlí",{"$f":"H18","v":5644.0000000000055},{"$f":"B43*'6. Orkubúskapur'!$B$34*0.001","v":767.58400000000074},{"$f":"B43*'6. Orkubúskapur'!$B$24*0.001","v":1108.269871822577}]
["Ágúst",{"$f":"I18","v":5691.4000000000015},{"$f":"B44*'6. Orkubúskapur'!$B$34*0.001","v":774.0304000000001},{"$f":"B44*'6. Orkubúskapur'!$B$24*0.001","v":1117.5774536660188}]
["September",{"$f":"J18","v":9099.1999999999935},{"$f":"B45*'6. Orkubúskapur'!$B$34*0.001","v":1237.491199999999},{"$f":"B45*'6. Orkubúskapur'!$B$24*0.001","v":1786.7415339631423}]
["Október",{"$f":"K18","v":11550.800000000005},{"$f":"B46*'6. Orkubúskapur'!$B$34*0.001","v":1570.9088000000008},{"$f":"B46*'6. Orkubúskapur'!$B$24*0.001","v":2268.1438050049992}]
["Nóvember",{"$f":"L18","v":13304.500000000007},{"$f":"B47*'6. Orkubúskapur'!$B$34*0.001","v":1809.4120000000009},{"$f":"B47*'6. Orkubúskapur'!$B$24*0.001","v":2612.504696963761}]
["Desember",{"$f":"M18","v":13861.799999999997},{"$f":"B48*'6. Orkubúskapur'!$B$34*0.001","v":1885.2047999999995},{"$f":"B48*'6. Orkubúskapur'!$B$24*0.001","v":2721.937510494362}]
[null,{"$f":"SUM(B37:B48)","v":126611.00000000001},{"$f":"SUM(C37:C48)","v":17219.096000000001},{"$f":"SUM(D37:D48)","v":24861.650733757648}]
[null,"Heild",{"$f":"SUM(C49:D49)","v":42080.746733757653}]

{"sheet":"11. Raki_töflur","index":10,"n_rows":68,"n_cols":4,"rows_kept":68,"cut":false,"hidden":true,"merged":[[0,0,0,9]]}
["Útreikningur á rakaflutningi"]
[]
["1. Mettunarrakamagn         í lofti [g/m3] - Heimild Sandin 2010"]
[]
["Nálgunarformúlur byggðar á töflu (TABELL 4.4) hér til hliðar:"]
[]
[]
[]
[]
[]
[]
[]
[]
[]
[]
[]
[]
[]
[]
[]
[]
["-3,0≤°C≤1,0"]
[null,"-0,0039*Ti^3-0,0055*Ti^2+0,3577*Ti+4,8343"]
["1,1≤°C≤7,0"]
[null,"0,0002*Ti^3+0,0099*Ti^2+0,3369*Ti+4,8383"]
["7,1≤°C≤15,0"]
[null,"3E-06*Ti^4+0,0001*Ti^3+0,0102*Ti^2+0,3387*Ti+4,8184"]
["15,1≤°C≤23,0"]
[null,"0,0004*Ti^3+0,0026*Ti^2+0,4443*Ti+4,2647"]
[]
[]
[]
[]
["2. Gufuhleypnisstuðull      [m2/s] - Heimild: Sandin 2010"]
[]
[null,"Efnislag","      [m2/s]"]
[null,"Kyrrstætt loft",2.5000000000000001E-5]
[null,"Steypa - K30","0,3-1,5E-6"]
[null,"Steypa - K50","0,1-1,0E-6"]
[null,"Léttsteypa (ρ=500 kg/m3)","5-15E-6"]
[null,"Steinull (ρ=15 kg/m3)",2.5000000000000001E-5]
[null,"Steinull (ρ=200 kg/m3)",1.0000000000000001E-5]
[null,"Frauðplast","0,1-5E-6"]
[null,"Sparsmúr (lime mortar)","2-4E-6"]
[null,"Sparslmúr (cement mortar)","1-2E-6"]
[null,"Sandsteinn (Kalksandsten - sænska)","0,5-1,5E-6"]
[null,"Múrsteinn (Tegel - sænska)","3-6E-6"]
[null,"Viður - léttar viðartegundir (hornrétt á trefjar)","0,3-2E-6"]
[]
["3.  Rakaflæðimótstaða      [s/m] - Heimild: Sandin 2010"]
[]
[null,"Efnislag","Þykkt [mm]","        [s/m]"]
[null,"Gifsplata",13,"(2-4)E3"]
[null,"Spónaplata",13,"(20*30)E3"]
[null,"Spónaplata",19,"(25-35)E3"]
[null,"Tjöruborin trétrefjaplata (ashalt impregnated)","13-19","(5-15)E3"]
[null,"Hörð trétrefjaplata",3.2,"(10-40)E3"]
[null,"Vatnsþéttur (þak)-pappi",null,">1000E3"]
[null,"Vindþéttur pappi",null,"<20E3"]
[null,"PVC (plast)-filma","1000 g/m2","(600-1200)E3"]
[null,"Polyethylene filma","0,15-0,20","(2000-4000)E3"]
[null,"PVC motta","2-3","(400-600)E3"]
[null,"Akryllatexmálning","0,1-0,2","(20-30)E3"]
[null,"Alkydmálning","0,09-0,12","(70-120)E3"]
[null,"PVA latexmálning","0,1-0,12","(7-10)E3"]
[null,"Polyutethanmálning","0,03-0,04","(90-120)E3"]
[null,"PVC-málning","0,03-0,04","(50-70)E3"]
[null,"Silikatmálning","0,08-0,10","(5-6)E3"]

{"sheet":"12. Gerðir","index":11,"n_rows":78,"n_cols":3,"rows_kept":78,"cut":false,"hidden":true,"merged":[]}
[]
["Gólfgerðir","Leiðrétting vegna hitamunar","Hitamunur"]
["Gólf án gólfgeisla",{"$f":"15/35","v":0.42857142857142855},15]
["Gólf m/gólfgeisla og einangrað á milli",{"$f":"20/35","v":0.5714285714285714},20]
["Gólf m/gólfgeisla ísteyptum í gólfplötu",{"$f":"'4. Hiti á efnisskilum'!G67/35","v":0.71978021978021978},{"$f":"'4. Hiti á efnisskilum'!G67","v":25.192307692307693}]
["Önnur","Sláið inn gildi",{"$f":"'2. Orkurammi'!J12*35","v":{"$error":"#VALUE!"}}]
[]
[{"$f":"MATCH('2. Orkurammi'!H12,Gólfgerðir,0)","v":1}]
[]
[]
["Gler","U gildi      [W/m2K]"]
["Tvöfalt venjulegt (12 mm loftbil)",2.9]
["Sólvarnargler - Energy N",1.1000000000000001]
["TopN+ (16 mm gasfyllt bil)",1.1000000000000001]
["TopN+ (12 mm gasfyllt bil)",1.3]
["K gler (12 mm gasfyllt bil)",1.6]
["K gler (12 mm loftbil)",1.9]
["Annað","Sláið inn gildi"]
[]
[{"$f":"MATCH('2. Orkurammi'!H22,Gluggagerðir,0)","v":3}]
[{"$f":"MATCH('2. Orkurammi'!H24,Gluggagerðir,0)","v":6}]
[]
["Hurðir"]
["Einangruð útihurð - 45 mm",1.2]
["Einangruð útihurð - 60 mm",0.9]
["Aðalhurð glerjuð að hluta",{"$f":"'5. Gluggar&Hurðir'!AN30","v":1.564339580040641}]
["Annað","Sláið inn gildi"]
[""]
[{"$f":"MATCH('2. Orkurammi'!H34,Hurðagerðir,0)","v":3}]
[]
["Svalahurð (0,9*2,05) - Ghlutf c.a. 52 %",{"$f":"'5. Gluggar&Hurðir'!AN29","v":1.7820162601626017}]
["Annað","Sláið inn gildi"]
[]
[{"$f":"MATCH('2. Orkurammi'!H36,Svalahurðir,0)","v":1}]
[]
[]
["Gerð byggingarhluta"]
[]
["Þak","U-gildi","Ein. Þykkt [mm]"]
["Létt þak",{"$f":"'3. Þykkt einangrunar'!E109","v":0.20000000000000007},{"$f":"'3. Þykkt einangrunar'!F111","v":211.70142857142855}]
["Uppstólað þak á steypta plötu",{"$f":"'3. Þykkt einangrunar'!E209","v":0.20000000000000004},{"$f":"'3. Þykkt einangrunar'!F211","v":220.56282051282054}]
["Viðsnúið þak",{"$f":"'3. Þykkt einangrunar'!E158","v":0.20000000000000004},{"$f":"'3. Þykkt einangrunar'!F160","v":249.7312454212454}]
["Kalt þak",{"$f":"'3. Þykkt einangrunar'!E264","v":0.20000000000000007},{"$f":"'3. Þykkt einangrunar'!F266","v":175.66714285714284}]
["Annað",{"$f":"'3. Þykkt einangrunar'!E531","v":{"$error":"#DIV/0!"}},{"$f":"'3. Þykkt einangrunar'!F533","v":0}]
[{"$f":"MATCH('2. Orkurammi'!M22,Þak_gerðir,0)","v":1}]
[]
["Steyptir veggir"]
["Steyptur veggur einangraður að innan",{"$f":"'3. Þykkt einangrunar'!E20","v":0.4},{"$f":"'3. Þykkt einangrunar'!F22","v":85.887357142857141}]
["Steyptur veggur einangraður að utan",{"$f":"'3. Þykkt einangrunar'!E67","v":0.4},{"$f":"'3. Þykkt einangrunar'!F69","v":122.28461538461539}]
["Annað",{"$f":"'3. Þykkt einangrunar'!E570","v":{"$error":"#DIV/0!"}},{"$f":"'3. Þykkt einangrunar'!F572","v":0}]
[{"$f":"MATCH('2. Orkurammi'!M24,Steyptir_veggir_gerðir,0)","v":1}]
[]
["Léttir veggir"]
["Léttur veggur",{"$f":"'3. Þykkt einangrunar'!E319","v":0.3},{"$f":"'3. Þykkt einangrunar'!F321","v":132.99610837438425}]
["Annað",{"$f":"'3. Þykkt einangrunar'!E620","v":{"$error":"#DIV/0!"}},{"$f":"'3. Þykkt einangrunar'!F622","v":0}]
[{"$f":"MATCH('2. Orkurammi'!M26,Léttir_veggir_gerðir,0)","v":1}]
[]
["Gólf"]
["Gólf - Sökkull með innveggjum",{"$f":"'3. Þykkt einangrunar'!E378","v":0.3},{"$f":"'3. Þykkt einangrunar'!F372","v":144.44220934316823}]
["Steypt gólf með gólfgeisla (tvöföld einangrun)",{"$f":"'3. Þykkt einangrunar'!E482","v":0.3},{"$f":"'3. Þykkt einangrunar'!F484","v":44.5}]
["Steypt gólf með gólfgeisla (einföld einangrun)",{"$f":"'3. Þykkt einangrunar'!E427","v":0.29999999999999993},{"$f":"'3. Þykkt einangrunar'!F429","v":73.98275862068968}]
["Annað",{"$f":"'3. Þykkt einangrunar'!E686","v":{"$error":"#DIV/0!"}},{"$f":"'3. Þykkt einangrunar'!F679","v":0}]
[{"$f":"MATCH('2. Orkurammi'!M28,Gólf_gerðir,0)","v":1}]
[]
[]
["Byggingarhlutar","Leiðnitap","%"]
["Þak",{"$f":"'2. Orkurammi'!E16","v":40.000000000000014},{"$f":"B67/$B$74","v":0.20370489692075852}]
["Steyptir veggir",{"$f":"'2. Orkurammi'!E17","v":60},{"$f":"B68/$B$74","v":0.30555734538113771}]
["Léttir veggir",{"$f":"'2. Orkurammi'!E18","v":0},0]
["Gólf",{"$f":"'2. Orkurammi'!E19","v":25.714285714285712},0.13095314802048758]
["Gluggar ",{"$f":"'2. Orkurammi'!E20","v":30.67368650752465},0.15620950370487421]
["Hurðir",{"$f":"'2. Orkurammi'!E21","v":6.6530853553393277},3.3881651662860134E-2]
["Kuldabrýr",{"$f":"'2. Orkurammi'!E37","v":33.321428571428569},0.16969345430988181]
[null,{"$f":"SUM(B67:B73)","v":196.36248614857828}]
[]
[]
["Já"]
["Nei"]

{"sheet":"13. Leiðbeiningar","index":12,"n_rows":423,"n_cols":13,"rows_kept":423,"cut":false,"hidden":false,"merged":[[39,0,39,8],[39,10,39,18],[40,0,40,8],[41,0,41,8],[38,0,38,8],[0,0,1,8],[34,0,34,8],[35,0,35,8],[37,0,37,8],[30,0,30,8],[31,0,31,8],[32,0,32,8],[33,0,33,8],[36,0,36,8]]}
["Leiðbeiningar",null,null,null,null,null,null,null,null,null,null,null,{"$f":"'1. Yfirlit'!B46","v":"Orkurammi_mini.xlsm"}]
[]
[]
["Verkefnaskjal (workbook) þetta var unnið sumarið 2013 í samstarfi við Mannvirkjastofnun.."]
["Lögum samkvæmt er hlutverk Mannvirkjastofunar m.a. að annast gerð leiðbeininga og hafa"]
["eftirlit með því að þeim lögum sé framfylgt sem lúta að fagsviði stofnunarinnar."]
[]
["Skjal þetta er hugsað sem aðstoð fyrir hönnuði við gerð orkureikninga og orkuramma, á "]
["hönnunarstigi byggingar. Lagt hefur verið upp með það að gera skjalið eins gagnvirkt og kostur er. "]
["Þannig geta hönnuðir prófað sín hönnun, þ.e. hvort ákvæðum í byggingarreglugerð varðandi "]
["leiðnitap byggingarhluta o.þ.h sé fullnægt. Ef hönnun uppfyllir ekki reglugerð eða ef viðkomandi vill "]
["prófa aðra hönnunarmöguleika er það auðvelt með hjálp forritsins. Þannig er hægt að prófa mismunandi"]
["gerðir byggingarhluta, mismunandi gler í glugga, skoða áhrif kuldabrúa og o.s.frv. Skjal þetta getur einnig"]
["komið sé vel sem lærdómstól fyrir þá sem eru að stíga sín fyrstu skref í þessum fræðum. Ath. skjal að"]
["er ekki ætlað til nákvæmnishönnunar á byggingum heldur tæki þar sem hönnuðir geta grófhannað hús"]
["m.t.t. þess að uppfylla kröfur um varmaleiðnitap."]
[]
["Hér  að neðan geta notendur nálgast leiðbeiningar sem gætu nýst vel. Að stórum hluta er hér um að ræða"]
["notkunarleiðbeiningar sem snúa að hvernig nota skal forritið, en þó er einnig hluti til útskýringar á þeirri"]
["fræði sem notuð er við útreikninga."]
[]
["ATH! Þetta er svokölluð Minni útgáfa forritsins, þ.e. ekki eru öll undirskjöl höfð með (t.d. raki o.fl)"]
["ATH! Mannvirkjastofnun tekur þátt í dreifingu forritsins en er á engan hátt ábyrg fyrir"]
["niðurstöðum. Ábyrgð er algjörlega í höndun þess er skjalið notar."]
["ATH! Mikilvægt er að velja Enable Macros the skjalið er opnað í fyrsta sinn, til þess að allt virki sem"]
["skildi. Skjalið fær þá endinguna .xlsm (í stað .xls eða .xlsx)"]
["ATH! Stór hluti að hverju skjali er verndaður (protected) gegn breytingum, ef ástæða þykir til er"]
["hægt að aflæsa (unprotect) með því að hægrsmella á nafn skjalsins og velja \"Unprotect sheet\""]
[]
["Í þessari Excel verkefnaskjali eru 12 undirskjöl (sheets) auk leiðbeiningaskjals:"]
[{"$f":"HYPERLINK(\"[\"&M1&\"]Yfirlit\",\"1. Yfirlit\")","v":"1. Yfirlit"}]
[{"$f":"HYPERLINK(\"[\"&M1&\"]Orkurammi_l\",\"2. Orkurammi\")","v":"2. Orkurammi"}]
[{"$f":"HYPERLINK(\"[\"&M1&\"]Þykkt_einangrunar_l\",\"3. Þykkt einangrunar\")","v":"3. Þykkt einangrunar"}]
[{"$f":"HYPERLINK(\"[\"&M1&\"]Hiti_á_efnisskilum_l\",\"4. Hiti á efnisskilum\")","v":"4. Hiti á efnisskilum"}]
[{"$f":"HYPERLINK(\"[\"&M1&\"]Gluggar_og_hurðir_l\",\"5. Gluggar og hurðir\")","v":"5. Gluggar og hurðir"}]
[{"$f":"HYPERLINK(\"[\"&M1&\"]Orkubúskapur_l\",\"6. Orkubúskapur\")","v":"6. Orkubúskapur"}]
[{"$f":"HYPERLINK(\"[\"&M1&\"]Rakabúskapur_l\",\"7.-8. Rakabúskapur\")","v":"7.-8. Rakabúskapur"}]
[{"$f":"HYPERLINK(\"[\"&M1&\"]Algengar_leiðnitölur_l\",\"9. Algengar leiðnitölur\")","v":"9. Algengar leiðnitölur"}]
[{"$f":"HYPERLINK(\"[\"&M1&\"]Veðurgögn_l\",\"10. Veðurgögn\")","v":"10. Veðurgögn"}]
[{"$f":"HYPERLINK(\"[\"&M1&\"]Raki_töflur_l\",\"11. Raki töflur\")","v":"11. Raki töflur"}]
[{"$f":"HYPERLINK(\"[\"&M1&\"]Gerðir_l\",\"12. Gerðir\")","v":"12. Gerðir"}]
[{"$f":"HYPERLINK(\"[\"&M1&\"]Heimildir_l\",\"Helstu heimildir\")","v":"Helstu heimildir"}]
[]
[]
[]
[]
[]
[]
[]
[]
["1. Yfirlit"]
["Eins konar \"upphafsskjal\" þar sem notendur geta notað flýtihnappa til þess að komast auðveldlega "]
["milli undirskjala og enn fremur á viðeigandi stað í hverju undirskali. Til hægri má sjá 5 flýtihnappa "]
["sem vísa hver um sig á mikilvæga staði í verkefnaskjalinu (Orkurammi, Algengar leiðnitölur,"]
["Orkubúskapur, Raki og Leiðbeiningar). Auðvelt er að komast aftur í yfirlitsskjalið með því að smella á"]
["flýtihnappinn \"Yfirlit\" í hverju skjali fyrir sig. "]
["Þar fyrir neðan er tafla sem notendur geta notað til að ákvarða og tilgreina gerð byggingarhluta "]
["hverju sinni, þ.e. Gerð þaks, veggja, gólfs o.s.frv. Með því að smella á þá gerð þaks sem óskað er  "]
["eftir, hoppar forritið yfir í skjalið \"Þykkt einangrunar\" og birtist uppbygging þeirrar þakgerðar "]
["(eins og hún birtist í ÍST 66:2008). Notendur geta þá breytt þykktum og leiðnitölum einstakra laga "]
["að vild. Ef notandi vill nota aðra þakgerð en sýnd er á listanum í \"Yfirlitsskjalinu\" skal velja \"Annað\","]
["þá birtist sniðmát (template) fyrir þak, þar sem hægt er að slá inn uppbygginu o.þ.h. að vild"]
["Hafa skal í huga ef uppbygging er slegin inn frá grunni þarf að gæta að því að formúlur séu "]
["réttar, t.d. fyrir einangrunarþykkt. Sama gildir fyrir veggi og gólf."]
[]
["Í dálkinn Notað gott að merkja við með krossi hvers konar gerð af byggingarhluta er notuð hverju sinni."]
["Þannig að ef notað er steyptur veggur einangraður að innan er sá reitur í Notað fylltur með krossi en"]
["reiturinn fyrir steyptan vegg einangraður að utan hafður tómur."]
[]
["Neðarlega á \"Yfirlits\" blaðinu/skjalinu er annars vegar skífurit sem sýnir hlutfall rauntaps fyrir hvern"]
["byggingarhluta sem fall af heildartapinu. Einnig má sjá töflu með helstu niðurstöðum. Ath skal að bæði"]
["skífuritið og taflan uppfærast sjálfkrafa, þ.e. ekki er gert ráð fyrir að þeim sé breytt á neinn hátt "]
["(nema útliti ef þess er óskað)."]
[]
["Skjalið er verndað (protected) gegn breytingum að mörgu leiti. Til að mynda er ekki hægt að bæta við"]
["röðum né dálkum og ekki er hægt að færa eða breyta flýtihnöppum. Í raunar er lokað fyrir allar  "]
["breytingar nema fyrir dálkinn \"Notað\", annað uppfærist sjálfkrafa eftir breytinum annars staðar "]
["í skjalinu."]
[]
["2. Orkurammi"]
["Tekur saman leiðnitap einstakra byggingarhluta, sem og kuldabrúa og finnur heildarleiðnitap byggingar. "]
["Heildarleiðnitapið er svo borið saman við ákvæði í byggingarreglugerð. Orkuramminn sjálfur birtist"]
["mönnum vinstra megin í skjalinu. Hægra megin er svo eins konar hönnunarhluti forritsins. Þar skal hönnun "]
["byggingarinnar að stóru leiti fara fram. Sambland af svokölluðum dropdown listum og innsláttarreitum"]
["eru í boði og auðvelt að prófa mismunandi hönnunarmöguleika á stuttum tíma. Allt sem valið er  "]
["í hönnunarfasanum hefur áhrif á orkurammann og uppfærir hann sjálfkrafa. Hér að neðan má lesa"]
["stuttar skýringar/fræði bakvið hvern hönnunarmöguleika:"]
[]
["Fyrsta hönnunartaflan ber heitið Gerð einstakra byggingarhluta. Fyrst er notandi spurður út í "]
["gólfgerð, þ.e. er notuð gólfhitun (gólfgeisli) eða ekki. Valmöguleikar sem í boði eru (hitamunur byggður"]
["á forsendum úr ÍST 66:2008"]
[]
[null,"Gólfgerð",null,null,null,"Hitamunur","Stuðull"]
[null,"Gólf án gólfgeisla",null,null,null,"15/35",{"$f":"15/35","v":0.42857142857142855}]
[null,"Gólf m/gólfgeisla og einangrað á milli",null,null,null,"20/35",{"$f":"20/35","v":0.5714285714285714}]
[null,"Gólf m/gólfgeisla ísteyptum í gólfplötu",null,null,null,"25,19/35",{"$f":"25.19/35","v":0.71971428571428575}]
[null,"Önnur",null,null,null,"-","-"]
[]
[]
[]
["Sá möguleiki (leiðréttingarstuðull) sem valin er í þessum reit kemur til minnkunar inn í reiti E19 og "]
["E34 (raunleiðnitap um gólf og kuldabrú vegna sökkuls undir útvegg), þannig að leiðnitap af völdum "]
["þessara þátta er margfaldað með stuðlinum. T.d ef valið er Gólf án gólfgeisla er leiðnitapið "]
["margfaldað með 0,43 o.s.frv. Notandi hefur einnig möguleika á að velja „Önnur“ þar sem hann "]
["tilgreinir sjálfur þannig leiðréttingastuðul sem hann telur lýsa best sinni hönnun. Ef það er gert litast "]
["reitur J12 brúnleitur og skal nýi leiðréttingarstuðullinn slegin inn í þann reit."]
[]
["Ef notandi hefur valið að nota gólf með gólfgeisla hefur hann næst valmöguleika á því að tilgreina "]
["hvort einangrun sé undir geislanum eða ekki. Ef valið er að einangra ekki undir geisla kemur stuðull "]
["45/35=1,29, vegna hitamismunar, til hækkunar þegar leiðnitap vegna sökkuls undir innvegg (reitur "]
["E35). Þessi stuðull er 1,00 ef einangrun er undir geisla þar sem útilokum hefur verið hluti af kuldabrú"]
["vegna sökkuls undir innvegg."]
[]
["Gluggar: Fyrst er spurt hvort U-gildi (vegið) glugga sé þekkt fyrirfram eða ekki. Hönnuðir hafa "]
["hugsanlega upplýsingar eða hafa gert reikninga áður til þess að finna U-gildi glugga. Ef svo er skal "]
["velja „Já“. Þá litast reitur I18 brúnleitur og skal U-gildið slegið þar inn. Það U gildi er svo afritað í "]
["Orkurammann og miðast reikningar við það gildi. Ef U-gildi er hins vegar ekki þekkt skal valið „Nei“. "]
["Þá er farið neðar í töfluna og valdar glergerðir sem notaðar verða, bæði fast gler og gler í opnanleg "]
["fög. Forritið reiknar sig þá í gegnum dæmigert íslenskt hús með timburglugga (sjá skjalið "]
["Gluggar&Hurðir) og metur U-gildi glugga út frá þeim glergerðum sem valdar voru: Þau gler sem í boði "]
["eru og U-gildi þeirra eru: "]
[]
[null,"Gler",null,null,"U gildi    "]
[null,"Tvöfalt venjulegt (12 mm loftbil)",null,null,2.9]
[null,"TopN+ (16 mm gasfyllt bil)",null,null,1.1000000000000001]
[null,"Sólvarnargler - Energy N",null,null,1.1000000000000001]
[null,"TopN+ (12 mm gasfyllt bil)",null,null,1.3]
[null,"K gler (12 mm gasfyllt bil)",null,null,1.6]
[null,"K gler (12 mm loftbil)",null,null,1.9]
[]
["Ef valið er Annað litast reitir I22 og/eða I24 og skal slegið inn U-gildi gluggaglerja þar. Allt sem valið er "]
["afritast svo í Orkurammann."]
[]
["Hurðir: Sama gildi um og hurðir og með gluggana. Möguleiki er að slá inn vegið U-gildi hurða eða "]
["velja gerð hverrar útihurðir (Aðalhurð og svalahurð) sem forritið keyrir svo saman við dæmigert hús "]
["og metur vegið U-gildi. Þær hurðatýpur sem í gefnar eru:"]
[]
[null,"Aðalhurð",null,null,"U gildi    "]
[null,"Einangruð útihurð - 45 mm",null,null,1.2]
[null,"Einangruð útihurð - 60 mm",null,null,0.9]
[null,"Aðalhurð glerjuð að hluta",null,null,1.56]
[null,"Annað",null,null,"-"]
[]
[null,"Svalahurð",null,null,"U gildi    "]
[null,"Svalahurð (0,9*2,05) - 52 % glerh.",null,null,1.78]
[null,"Annað",null,null,"-"]
[]
["Bæði fyrir glugga og hurðir er möguleiki að nákvæmnisreikna U-gildi hvers glugga og fá þannig "]
["nákvæmt U-gildi glugga eða hurða fyrir þá hönnun. Til þess skal nota töflur 1 og 2 í skjalinu "]
["Gluggar&Hurðir."]
["Þar næst er tafla þar sem skal slá inn Flatarmál byggingarhluta. Þau flatarmál sem slegin eru inn "]
["afritast svo beint inn í Orkurammann og miðast útreikningar við þessar tölur. Ath ! að þegar er slegið "]
["er inn Heildarfermetrafjöldi gólfs er miðað við all það gólfrými sem möglegt að ganga á í byggingunni, "]
["þ.e. ef húsið er á mörgum hæðum skal summera upp allt gólfpláss. Þegar slegið er inn flatarmál gólfs "]
["hins vegar er miðað við botnplötu. "]
[]
["Að lokum í hönnunarhlutanum er valin gerð byggingarhluta (Þak, steyptir veggir, léttir veggir, gólf). "]
["Valið er af listum (merktir grænu) og uppfærist þá U-gildi og einangrunarþykkt. Öll U-gildi eru stillt "]
["þannig í upphafi að þau mæti lágmarkskröfum skv. Byggingarreglugerð. T.d. eru allar þaktýpur með "]
["U-gildi 0,20. Ætlast er til að notendur geri allar breytingar á gerðum byggingarhluta í skjalinu Þykkt "]
["einangrunar. Best er að gera það með því að fara í skjalið Yfirlit og velja þaðan þá gerð sem notandi "]
["vill hverju sinni. T.d. ef valið er að nota Létt þak fyrir byggingu skal fara í skjalið Yfirlit og velja Létt "]
["þak, þá er notandi fluttar á réttan stað í skjalinu Þykkt einangrunar. Þar er svo hægt að breyta "]
["uppsetningu eða einangrunarþykktum o.s.frv til þess að ná fram hægastæðara U-gildi."]
[]
["Allt sem vaið er í hönnunartöflunum afritast í Orkurammann,  aðeins þeir reitir sem eru merktir með "]
["bláu krefjast þess að slegið sé beint inn .Það á við lýsingu á byggingarhlutum, lengd kuldabrúa. Einnig "]
["verða reitir með línutapi hverrar kuldarbrúar fyrir sig opnir svo hægt að breyta þeim gildum ef óskað "]
["er. Stuðst var við ÍST 66:2008 og bókina Varmaeinangrun húsa (1992) við ákvörðun á þeim "]
["kuldabrúargildum (ψ) sem eru í töflu 3. "]
[]
["\"Orkurammi reiknar kröfu út frá töflu 1 og raun út frá töflu 2 og töflu 3 (þ.e. tafla2+tafla3)."]
[" Ef krafa/raun hefur gildi stærra eða jafnt og 1, birtist í reiknum við hliðina á \"Í lagi\" annars"]
["\"Ekki í lagi!\". Ef gildið er lægra er 1 er nauðsynlegt að gera breytingar. Augljósasti valmöguleikinn"]
[" væri að auka einangrunarþykktir (og þarf með minnka leiðnitap) einhvers byggingarhluta."]
[]
["\"Orkurammi\" athugar einnig hvort skilyrðum sem koma fram í kafla 13. kafla byggingarreglugerðar um"]
["Orkusparnað og hitaeinangrun sé fullnægt: "]
["Annars vegar grein 13.2.4 þar sem segir „Á aðaluppdráttum skal gefið upp reiknað leiðnitap fyrir"]
["hverja °C á fermetra gólfflatar (W/m2°C)\". Í reglugerðinni er ekki tilgreint hámarks eða lágmark"]
["sem þetta gildi þarf að uppfylla."]
["Hins vegar grein 13.3.2 um leyfilegt hámark U-gilda einstakra byggingarhluta (ný mannvirki og "]
["viðbyggingar). Þar stendur: Útveggir, vegið meðaltal leyft hámark 0,85. Ef reiknað gildi frá \"Orkuramma\""]
["er hærra en 0,85 birtist \"Ekki í lagi!\". Þá þarf að gera einhverjar breytingar á hönnun."]
[]
["ATH !Góð regla er að athuga hvort tiltekið gildi í reit hafi formúlu bak við sig ('='), þá skal því ekki breytt "]
[" nema að vel ígrunduðu máli"]
[]
["Einnig er hvatt til þess að notendur lesi vel þær athugasemdir sem koma fram í skjalinu \"Orkurammi\"."]
[]
["3. Þykkt einangrunar"]
["Innsláttarskjal. Frá \"Þykkt einangrunar\" geta notendur ákvarðað einangrunarþykktir og U gildi þaks, "]
["steyptra veggja, léttra veggja og gólfs. Settar hafa verið upp týpur af áðurgreindum byggingarhlutum"]
["sem eru dæmigerðar fyrir íslenskar aðstæður. Valmöguleiki er að slá inn einangrunarþykkt fyrirfram og"]
["reiknar þá forritið samsvarandi U-gildi eða ef U-gildi er ekki þekkt er einangrunarþykktin reiknuð út"]
["miðað við það mótstöðugildi Rnauðsyn og mótstöðu einstakra laga. Gerðir byggingarhlua sem eru í boði:"]
[]
["Þak: Létt þak, uppstólað þak á steypta plötu, viðsnúið þak og kalt þak"]
["Steyptir veggir: Steyptur veggur einangraður að innan, steyptur veggur einangraður að utan"]
["Léttir veggir: Léttur veggur (dæmigerður)"]
["Gólf: Steypt gólf (sökkull með innveggjum) og steypt gólf með gólfgeisla (einangrað í 1 eða 2 lögum)"]
[]
["Einnig gefst notendum kostur á að velja Annað í skjalinu \"Yfirlit\" og geta þá sett upp sýnar eigin "]
["uppbyggingu á hverjum byggingarhluta. Ef Annaðer valið þarf að huga vel að því að formúlur séu"]
["réttar hverju sinni. Rétt er að hafa í huga að einnig er hægt að breyta sniðmátunum fyrir hverja týpu"]
["(t.d. Létt þak) en huga verður þá að því að fylgjast með því að formúlur séu réttur, t.d. ef bætt er við"]
["eða efnum/lögum eytt."]
["Með \"Þykkt einangrunar\" getur notandinn reiknað einangrunarþykkt og U-gildi byggingarhluta.   "]
["Athuga skal þó að einangrunarþykktin hefur formúlu á bak við sig sem byggir m.a. á Rnauðsyn"]
["(nauðsynlegri varmamótstöðu) sem aftur ákvarðar U gildi. Með öðrum örðum þá breytist ekki "]
["einangrunarþykktin ef loka U-gildið er slegið beint inn. Aftur á móti ef einangrunarþykktinni er breytt"]
["þá fylgir U-gildið með. Einnig er hægt að hækka/lækka Rnauðsyn, þá fylgja gildin á bæði U og"]
["einangrunarþykktinni með. Einangrunarþykktirnar eins og þær eru þegar skjalið er opnað í fyrsta sinn"]
["eru lágmarks einangrunarþykktir, þ.e. þær þykktir sem þarf til að mæta lágmarkskröfum"]
["um U-gildi byggingarhluta skv. byggingarreglugerð. Ef að U-gildið uppfyllir ekki kröfu reglugerðar"]
["birtist \"Ekki í lagi\" í reitnum við hliðina á sem er merktur gulur."]
[]
["Sniðmátin fyrir hverja gerð eru fengin úr ÍST66:2008. Þar sem aðalnotagildi þessa skjals er hugsað á"]
["hönnunartíma mannvirkis eru ýmsum \"smáatriðum\" í uppbyggingu byggingahluta breytt. Svo sem fyrir"]
["Létt þak. T.d er Rakavarnarlag (PE) og lag fyrir lagnagrind/steinull (25 mm) tekið saman í eitt "]
["loftbil með varmamótstöðu 0,08. Ef hönnuðir hafa undir höndum nákvæma lokahönnun er auðvelt að "]
["bæta/breyta sniðmátinu fyrir t.d. Létt þak, eða hreinlega velja Annað í \"Yfirlit\" og setja upp eigin gerð."]
[]
["Reiknað gildi fyrir þykkt einangrunar er fengið með því að taka Rnauðsyn (sem er miðað við U frá "]
["reglugerð auk kuldabrúa eða annarra liða sem auka á nauðsynlega þykkt). Frá Rnauðsyn eru dregnar"]
["allar mótstöður laga nema einangrunarlagsins. Að lokum er margfaldað með leiðnitölu einangrunar."]
["Þessu má lýsa með formúlunni:"]
[]
[]
[]
["Þar sem: "]
[]
[]
[]
["U gildið og einangrunarþykktin fyrir notaða gerð hvers byggingarhluta (þak, veggir, gólf) afritast "]
["sjálfkrafa inn í hönnunartöfluna fyrir Gerð byggingarhluta í \"Orkurammi\", þar sem velja þarf  þá gerð"]
["hvers byggingarhluta af lista sem notuð er hverju sinni."]
[]
["4. Hiti á efnisskilum"]
["Gefur frekari upplýsingar um hitastig á milli einstakra laga í byggingarhluta. Sett hefur verið upp hiti"]
["á efnisskilum fyrir 4 týpur:"]
["Steyptur veggur einangraður að innan, steyptur veggur einangraður að utan"]
["Gólf með gólfgeisla (2 einangrunarlög) og gólf með gólfgeisla (1 einagrunarlag)"]
["Ekki þarf að slá inn neinar tölur í skjalið \"Hiti á efnisskilum\" nema ef notendur vilja nota önnur gildi"]
["á inni-og/eða útihita. Gröf fyrir hita á efnisskilum sýna hitastig (°C) sem fall af þykkt byggingarhluta (m) "]
["eða öfugt. Miðað er við hitastig inni og úti líkt og tekið er fram í staðli (Δt=35°C). Reiknað er með"]
[" línulegri nálgun á hitastigul milli einstakra laga. Ath. skal að ef um ræðir gólf með gólfgeisla"]
["er innihitinn tekin sem 30°C og jarðhiti 5°C (Δt=25°C). Einfalt er setja upp samskonar töflu og graf fyrir"]
["aðrar gerðir byggingarhluta með því að nota sömu formúlur og í \"Hiti á efnisskilum\"."]
[]
[]
[]
["5. Gluggar og hurðir"]
["Í þessu skjali er búið að setja upp í töflu 1 og töflu 2 reikninga fyrir dæmigerða hönnun á húsi"]
["eins og er oft notuð í dag. Því þarf í raun ekki að breyta neinu í þessu skjali, heldur velja gler-"]
["gerðir í \"Orkurammi\", bæði fast gler og opnanleg fög. Þegar það hefur verið gert reiknar "]
["forritið út frá \"fyrirmyndargluggunum\" vegið U-gildi. Ef hins vegar hönnuðir vilja nákvæmnis-"]
["reikna U-gildi glugga og hurðir er hægt að nota töflur 1 og 2 til þess. "]
["Skjalið er ætlað til þess að finna vegið U gildi og flatarmál allra glugga og hurða. Notendur geta "]
["fundið nákvæmlega stærðir s.s. Múrmál, karmlengd, póstalegt, flatarmál glerja o.frv."]
["með því að nýta sér töflu 1 og 2.  Þar sem þetta skjal er á hugsað til notkunar á hönnunarstigi er ekki"]
["víst að allar þær upplýsingar um einstaka glugga og hurðir liggi fyrir á þessu stigi (s.s. falsdýpt,"]
["karmbreidd og póstabreidd einstakra gluggagerða). Skjalið er þá einföld og fljótleg leið til að meta U-gildi"]
["út frá glergerðum glugga, og hurðatýpum."]
[]
["Vegið meðaltal U gildis fyrir bæði glugga og hurðir er fundið með því að deila leiðnitapi á kelvin með"]
["múrmáli glugga/hurða. Taka verður fram í töflu 3 fjölda glugga/hurða af hverri gerð:"]
[]
[]
[]
["Flatarmál og vegin gildi glugga og hurða afritast sjálfkrafa inn í viðeigandi reiti í skjölunum \"Yfirlit\""]
["og \"Orkurammi\". "]
[]
["6. Orkubúskapur"]
["Þetta skjal er hugsað sem eins konar framhald af \"Orkurammi\". \"Orkubúskapur\" tekur inn gildi frá"]
["\"Orkurammi\" og áætlar afl- og varmaþörf byggingar. Í töflu 1 eru gildi sem afrituð hafa verið  "]
["frá \"Orkurammi\". Í þeirri töflu þarf ekki að slá neitt inn. Ath skal að í gildin í dálki D í töflu 1 hafa þegar"]
["verið leiðrétt (til minnkunar/hækkunar vegna hitamunar sem er annar en 35°C). Þess vegna er ∆t í"]
["öllum tilfellum 35°C."]
[]
["Tafla 1 reiknar út leiðnitap byggingarhluta í bæði W/K og W. Auk þess er reiknað út leiðnitap af völdum "]
["kuldabrúa í sömu einingum. eðst í töfluni er svo heildarleiðnitapið reiknað. Leiðnitap í wöttum er reiknað"]
[" á eftirfarandi hátt:"]
[]
["Með töflu 2 má reikna út varmatap vegna loftskipta, þ.e. þegar skipt er á köldu útilofti og hlýju innilofti. "]
["Í staðlinum ÍST EN 832:1998 kemur fram hvernig reikna skal loftskipti. Mælt er með jöfnunni:"]
[]
[]
[]
[]
[]
[]
[]
[]
["Taflan tekur inn gólfflatarmál (botnplata) margfaldar með lofthæð til þess að áætla rúmmál upphitaðs rýmis."]
["Loftskipti (n) eru áætluð sem 0,8 en skiptar skoðanir eru um gildið á þeirri tölu. Til að mynda er ráðlagt"]
["í staðlinum ÍST EN 832:1998 að miða við að n=0,5 nema annað sé betur þekkt."]
[]
[]
[]
[]
[]
["Í töflu 3 er reiknuð gildi á afl- og varmaþörf. Aflþörf byggir á eftirfarandi jöfnu:"]
[]
[]
[]
[]
[]
[]
["Ath. Skal að í orkureikningunum er ekki reiknað með svokölluðum gjafavarma innanhús (oft 2-3°C í"]
["innihita). Því má segja að matið sé eins konar efri mörk á afl- og varmaþörf."]
[]
["Í skjalinu er miðað við innihita 20°C og viðmiðunarútihita -15°C."]
["Varmaþörf er reiknuð samkvæmt jöfnunni:"]
[]
[]
[]
["Gráðutímar er summa margfeldis hitamismunar og tíma ef einingin er klukkustundir (Gráðudagar ef"]
["tímaeiningin er dagar). Í töflu 3 sést varmaþörfin á ársgrundvelli í einingunni kWh/ár. Í töflu 4 er"]
["varmaþörfin reiknuð á mánaðargrundvelli. Til þess að geta reiknað gráðutíma þarf veðurgögn um "]
["hitastig og tíma á þeirri veðurstöð sem er mannvirkinu næst. Þegar smellt er reit H2 töflu 4 er birtist  "]
["listi yfir staði á landinu. Þeir staðir sem þegar eru veðurgögn frá eru:"]
[null,null,null,"- Akureyri"]
[null,null,null,"- Egilsstaðir"]
[null,null,null,"- Hella"]
[null,null,null,"- Keflavík"]
[null,null,null,"- Ísafjörður"]
[null,null,null,"- Reykjavík"]
[]
["Þegar staður er valinn uppfærist tafla 4 sjálfkrafa og í leiðinni stöplaritin fyrir neðan töfluna. Stöplaritin"]
["sýna annars vegar uppsafnaða mánaðar varmaþörf, þ.e. Bæði vegna leiðnitaps og loftskipta og hins "]
["vegar sundurliðaða varmaþörf."]
["Um leið uppfærist gráðutímafjöldinn og varmaþörfin í töflu 3. Hægt er að smella á "]
["flýtihnappinn Bæta við veðurgögnum hægra megin við töflu 4 til þess að bæta við staðsetningu eða "]
["uppfæra gögn o.s.frv."]
[]
["Í raun væri hægt að ganga enn lengra og nýta sér verkefnaskjalið til að reikna út hagkvæmustu "]
["einangrunarþykkt (sem uppfyllir byggingarreglugerð) út frá varmaþörf og orkuverði, sem og ofnastærðir "]
["og o.fl. Það verður þó ekki gert hér, en hönnuðir geta sett  upp slíka reikninga í nýju undirskjali kjósi þeir"]
["það."]
[]
["7.-8. Rakabúskapur"]
["Í undirskjölum nr. 7-8 hefur verið tekin rakabúskapur fyrir steinsteypta veggi, bæði þegar einangrað"]
["er að innan og utan. Tvær aðferðir eru notaðar við reikninga, annars vegar byggð á mettunarraka (skjal 7)"]
["og hins vegar mettunarþrýstingi (skjal 8). Kalla mætti þá fyrri sænsku leiðina.Fræðin bak við þá aðferð"]
["sést að miklu leiti í skjalinu \"Raki töflur\". Miðið er við eftirfaranadi umhverfisaðstæður (má breyta):"]
[]
[]
[]
[]
[]
[]
[null,null,null,"Lofthiti (°C)","Loftraki (%HR)"]
[null,null,"Vetur"]
[null,null,"Inni",22,40]
[null,null,"Úti",-2,80]
[null,null,"Sumar"]
[null,null,"Inni",22,55]
[null,null,"Úti",10,80]
[]
["Út frá töflunum er metið hvort hætta sé á döggvun (rakauppsöfnun) og hvar hún verður. Einnig er mat"]
["á rakauppsöfnun að vetri til og útþornun að sumri til. Döggvun verður ef HR (%) er hærri en 100 %."]
[]
["9. Algengar leiðnitölur"]
["Í skjalinu geta hönnuðir nálgast helstu varmaleiðnitölur og rúmþyngdir fyrir byggingarefni sem notuð eru"]
["á Íslandi.Hægt er að vitna beint í viðeigandi reiti, t.d. Þegar slegnar eru inn leiðnitölur fyrir einstök lög "]
["þegar U gildi eru fundin í \"Þykkt einangrunar\". Taflan er alls ekki tæmandi og auðvelt að bæta við efnum"]
["með því að bæta við línu ef notendur kjósa þess. Við gerð töflunnar var haft til hliðsjónar annars vegar "]
["Tafla 2.4 í bókinni Varmaeinangrun húsa frá árinu 1992 og hins vegar formúlu og töflukver frá "]
["Birni Marteinssyni frá árinu 2008. Ath ber að gildin fyrir bæði rúmþyngdir og varmaleiðnitölur eru"]
["ekki algild og miða við \"mest notuðu\" eiginleika hvers byggingarefnis.þurfa notendur að vega og meta "]
["eftir aðstæðum hvort gildin eiga við. Einnig eru U-gildi fyrir helstu gluggagler sem notuð eru hérlendis."]
[]
["10. Veðurgögn"]
["Með skjalinu \"Veðurgögn\" geta notendur sett inn ný veðurgögn (gráðutímafjölda) eða uppfært"]
["að vild. Í töflu 4 í skjalinu \"Orkubúskapur\" er hægt að velja um sex staðsetningar á landinu "]
["(Reykjavík, Akureyri, Egilsstaði, Ísafjörð, Keflavík og Hellu) og er byggt á  veðurgögn fyrir árið 2012. "]
["Ef bæta á við nýjum stað geta notendur einfaldlega bætt við nafninu og nýjum gögnum neðst í efri"]
["töfluna í \"Veðurgögn\". Því næst verður að skýra bæta nýjustu gögnunum við Gráðutímar_mán í "]
["Name Manager. Hægt er að gera það með eftirfarandi skrefum:"]
[null,null,"1. Bæta við veðurgögnum neðst í töflu"]
[null,null,"2. Velja CTRL+F3 (Þá opnast Name Manager)"]
[null,null,"3. Finna Gráðutímar_Mán og velja Edit"]
[null,null,"4. Velja Refers to og bæta við nýju gögnunum"]
["Gráðutímar_mán á við reiti B6:M11 í \"Orkubúskapur. Ef bætt yrði við einni línu ætti Gráðutímar_mán"]
["að á til B6:M12 o.s.frv."]
["Á sama hátt þarf að fara í Name Manager (CTRL+F3) og bæta við heitinu á nýja staðnum við Staður."]
["Staður eru reitirnir B6:B11 og ef bætt væri við einni línu ætti Staður að ná til B6:B12. Tafla 4 í"]
["\"Orkubúskapur\" uppfærist þá sjálfkrafa og verður hægt að velja nýja staðinn í drop-down listanum."]
[]
["Með því að nýta innbyggð föll MATCH og INDEX uppfærast gögnin í seinni töflunni í \"Veðurgögn\" "]
["og í leiðinni skjalið \"Orkubúskapur\". Ekki þarf að eiga við seinni töfluna í \"Veðurgögn\"."]
[]
["11. Raki töflur (fræði)"]
["Í þessu skjali er sýnd fræðin bak við töflurnar í \"7. Raki_rakamagn\". Samband milli mettunarrakamagns"]
["og hitastigs hefur verið nálgað með þeim jöfnum sem sjást á grafinu efst í skjalinu. Hinar töflurnar"]
["eru fengnar beint úr bókinni Praktisk byggnadsfysik eftir hinn sænska Kenneth Sandin."]
[]
[]
[]
[]
[]
["12. Gerðir"]
["Skjal sem tengir saman skjalið þannig að allt uppfærist eins og á að gera. Forðast skal að gera "]
["breytingar á því nema að menn þekki vel til."]
[]
[]
["Helstu heimildir"]
["Staðlaráð Íslands (2008). Íslenskur staðall ÍST 66:2008.Varmatap húsa - Útreikningar. Reykjavík"]
[]
["Guðmundur Halldórsson og Jón Sigurjónsson (1992). Rit nr. 30, útg. 3. Varmaeinangrun húsa."]
["Keldnaholt, Reykjavík"]
[]
["Óli Hilmar Jónsson (1982). Raki í húsum. Keldnaholt, Reykjavík"]
[]
["Guðmundur Halldórsson og Jón Sigurjónsson (1990). Rit nr. 55, útg. 2. Hitun húsa. Keldnaholt,"]
["Reykjavík"]
[]
["Sandin, Kenneth (2010). Praktisk Byggnadsfysik. Studentlitteratur AB, Lund. Svíþjóð"]
[]
["Björn Marteinsson (2009). Húsagerð - samantekt. Reykjavík"]
[]
["Björn Marteinsson (2013). Útreikningar fyrir Engjaþing 9-23 (Excel skjal). "]

{"sheet":"Tölur fyrir gröf","index":13,"n_rows":23,"n_cols":11,"rows_kept":23,"cut":false,"hidden":true,"merged":[]}
[]
[null,0,30,null,null,null,null,null,null,0,{"$f":"'4. Hiti á efnisskilum'!AF63","v":30}]
[null,{"$f":"'4. Hiti á efnisskilum'!C64","v":0.03},{"$f":"'4. Hiti á efnisskilum'!G65","v":30},null,null,null,null,null,null,{"$f":"'4. Hiti á efnisskilum'!AB64","v":3.5000000000000003E-2},{"$f":"'4. Hiti á efnisskilum'!AF65","v":30}]
[null,{"$f":"'4. Hiti á efnisskilum'!C64+'4. Hiti á efnisskilum'!C66","v":5.5E-2},{"$f":"'4. Hiti á efnisskilum'!G67","v":25.192307692307693},null,null,null,null,null,null,{"$f":"'4. Hiti á efnisskilum'!AB64+'4. Hiti á efnisskilum'!AB66","v":0.13500000000000001},{"$f":"'4. Hiti á efnisskilum'!AF67","v":29.628205128205128}]
[null,{"$f":"'4. Hiti á efnisskilum'!C64+'4. Hiti á efnisskilum'!C66+'4. Hiti á efnisskilum'!C68","v":0.155},{"$f":"'4. Hiti á efnisskilum'!G69","v":24.80769230769231},null,null,null,null,null,null,{"$f":"'4. Hiti á efnisskilum'!AB64+'4. Hiti á efnisskilum'!AB66+'4. Hiti á efnisskilum'!AB68","v":0.20898275862068968},{"$f":"'4. Hiti á efnisskilum'!AF69","v":15.874999999999998}]
[null,{"$f":"'4. Hiti á efnisskilum'!C64+'4. Hiti á efnisskilum'!C66+'4. Hiti á efnisskilum'!C68+'4. Hiti á efnisskilum'!C70","v":0.19950000000000001},{"$f":"'4. Hiti á efnisskilum'!G71","v":16.250000000000004},null,null,null,null,null,null,{"$f":"J5","v":0.20898275862068968},{"$f":"'4. Hiti á efnisskilum'!AF72","v":5}]
[null,{"$f":"'4. Hiti á efnisskilum'!C64+'4. Hiti á efnisskilum'!C66+'4. Hiti á efnisskilum'!C68+'4. Hiti á efnisskilum'!C70","v":0.19950000000000001},{"$f":"'4. Hiti á efnisskilum'!G74","v":5}]
[]
[]
[]
[]
[]
[]
[]
[]
[null,0,{"$f":"'4. Hiti á efnisskilum'!G5","v":-15},null,null,null,null,null,null,0,{"$f":"'4. Hiti á efnisskilum'!AF5","v":-15}]
[null,0,{"$f":"'4. Hiti á efnisskilum'!G8","v":-14.44},null,null,null,null,null,null,0,{"$f":"'4. Hiti á efnisskilum'!AF8","v":-13.817}]
[null,{"$f":"'4. Hiti á efnisskilum'!C9","v":1E-3},{"$f":"'4. Hiti á efnisskilum'!G10","v":-14.435333333333332},null,null,null,null,null,null,{"$f":"'4. Hiti á efnisskilum'!AB9","v":0.02},{"$f":"'4. Hiti á efnisskilum'!AF10","v":-13.817}]
[null,{"$f":"'4. Hiti á efnisskilum'!C9+'4. Hiti á efnisskilum'!C11","v":2.1000000000000001E-2},{"$f":"'4. Hiti á efnisskilum'!G12","v":-14.235333333333333},null,null,null,null,null,null,{"$f":"'4. Hiti á efnisskilum'!AB9+'4. Hiti á efnisskilum'!AB11","v":0.04},{"$f":"'4. Hiti á efnisskilum'!AF12","v":-13.817}]
[null,{"$f":"'4. Hiti á efnisskilum'!C9+'4. Hiti á efnisskilum'!C11+'4. Hiti á efnisskilum'!C13","v":0.20099999999999998},{"$f":"'4. Hiti á efnisskilum'!G14","v":-12.94302564102564},null,null,null,null,null,null,{"$f":"'4. Hiti á efnisskilum'!AB9+'4. Hiti á efnisskilum'!AB11+'4. Hiti á efnisskilum'!AB13","v":0.16228461538461539},{"$f":"'4. Hiti á efnisskilum'!AF14","v":17.977}]
[null,{"$f":"'4. Hiti á efnisskilum'!C9+'4. Hiti á efnisskilum'!C11+'4. Hiti á efnisskilum'!C13+'4. Hiti á efnisskilum'!C15","v":0.28688735714285712},{"$f":"'4. Hiti á efnisskilum'!G16","v":17.888333333333335},null,null,null,null,null,null,{"$f":"'4. Hiti á efnisskilum'!AB9+'4. Hiti á efnisskilum'!AB11+'4. Hiti á efnisskilum'!AB13+'4. Hiti á efnisskilum'!AB15","v":0.34228461538461541},{"$f":"'4. Hiti á efnisskilum'!AF16","v":18.817}]
[null,{"$f":"'4. Hiti á efnisskilum'!C9+'4. Hiti á efnisskilum'!C11+'4. Hiti á efnisskilum'!C13+'4. Hiti á efnisskilum'!C15+'4. Hiti á efnisskilum'!C17","v":0.31188735714285715},{"$f":"'4. Hiti á efnisskilum'!G18","v":18.180000000000003},null,null,null,null,null,null,{"$f":"'4. Hiti á efnisskilum'!AB9+'4. Hiti á efnisskilum'!AB11+'4. Hiti á efnisskilum'!AB13+'4. Hiti á efnisskilum'!AB15","v":0.34228461538461541},{"$f":"'4. Hiti á efnisskilum'!AF19","v":20}]
[null,{"$f":"'4. Hiti á efnisskilum'!C9+'4. Hiti á efnisskilum'!C11+'4. Hiti á efnisskilum'!C13+'4. Hiti á efnisskilum'!C15+'4. Hiti á efnisskilum'!C17","v":0.31188735714285715},{"$f":"'4. Hiti á efnisskilum'!G21","v":20}]